ACCESSION: MSBNK-Washington_State_Univ-BML80391
RECORD_TITLE: 3-Methyluridine; LC-ESI-QTOF; MS; NEGATIVE
DATE: 2016.01.19 (Created 2012.10.26)
AUTHORS: Cuthbertson DJ, Johnson SR, Lange BM, Institute of Biological Chemistry, Washington State University
LICENSE: CC BY-SA
COMMENT: relative retention time with respect to 9-anthracene Carboxylic Acid is 0.102

CH$NAME: 3-Methyluridine
CH$COMPOUND_CLASS: N/A
CH$FORMULA: C10H14N2O6
CH$EXACT_MASS: 258.085186
CH$SMILES: CN1C(=O)C=CN(C1=O)C2C(C(C(O2)CO)O)O
CH$IUPAC: InChI=1S/C10H14N2O6/c1-11-6(14)2-3-12(10(11)17)9-8(16)7(15)5(4-13)18-9/h2-3,5,7-9,13,15-16H,4H2,1H3
CH$LINK: CAS 2140-69-4
CH$LINK: CHEMSPIDER 280553
CH$LINK: PUBCHEM CID:316991
CH$LINK: INCHIKEY UTQUILVPBZEHTK-UHFFFAOYSA-N

AC$INSTRUMENT: Agilent 1200 RRLC; Agilent 6520 QTOF
AC$INSTRUMENT_TYPE: LC-ESI-QTOF
AC$MASS_SPECTROMETRY: MS_TYPE MS
AC$MASS_SPECTROMETRY: ION_MODE NEGATIVE
AC$MASS_SPECTROMETRY: SCANNING m/z 100-1000
AC$CHROMATOGRAPHY: COLUMN_NAME Agilent C8 Cartridge Column 2.1X30mm 3.5 micron (guard); Agilent SB-Aq 2.1x50mm 1.8 micron (analytical)
AC$CHROMATOGRAPHY: COLUMN_TEMPERATURE 60 C
AC$CHROMATOGRAPHY: FLOW_GRADIENT linear from 98A/2B at 0 min to 2A/98B at 13 min, hold 6 min at 2A/98B, reequilibration 98A/2B (5 min)
AC$CHROMATOGRAPHY: FLOW_RATE 0.6 ml/min
AC$CHROMATOGRAPHY: RETENTION_TIME 0.749
AC$CHROMATOGRAPHY: SOLVENT A water with 0.2% acetic acid
AC$CHROMATOGRAPHY: SOLVENT B methanol with 0.2% acetic acid

PK$SPLASH: splash10-014i-0029000000-04f04e2c4b3a9698551e
PK$NUM_PEAK: 2
PK$PEAK: m/z int. rel.int.
  257.0779235 12212 296
  317.098504 41268 999