ACCESSION: MSBNK-Washington_State_Univ-BML80562
RECORD_TITLE: 6-Methylflavone; LC-APCI-QTOF; MS; POSITIVE
DATE: 2016.01.19 (Created 2012.10.26)
AUTHORS: Cuthbertson DJ, Johnson SR, Lange BM, Institute of Biological Chemistry, Washington State University
LICENSE: CC BY-SA
COMMENT: relative retention time with respect to 9-anthracene Carboxylic Acid is 1.300

CH$NAME: 6-Methylflavone
CH$COMPOUND_CLASS: N/A
CH$FORMULA: C16H12O2
CH$EXACT_MASS: 236.08373
CH$SMILES: CC1=CC2=C(C=C1)OC(=CC2=O)C3=CC=CC=C3
CH$IUPAC: InChI=1S/C16H12O2/c1-11-7-8-15-13(9-11)14(17)10-16(18-15)12-5-3-2-4-6-12/h2-10H,1H3
CH$LINK: CAS 29976-75-6
CH$LINK: CHEMSPIDER 600396
CH$LINK: PUBCHEM CID:689013
CH$LINK: INCHIKEY NOQJBXPAMJLUSS-UHFFFAOYSA-N
CH$LINK: COMPTOX DTXSID40351008

AC$INSTRUMENT: Agilent 1200 RRLC; Agilent 6520 QTOF
AC$INSTRUMENT_TYPE: LC-APCI-QTOF
AC$MASS_SPECTROMETRY: MS_TYPE MS
AC$MASS_SPECTROMETRY: ION_MODE POSITIVE
AC$MASS_SPECTROMETRY: SCANNING m/z 100-1000
AC$CHROMATOGRAPHY: COLUMN_NAME Agilent C8 Cartridge Column 2.1X30mm 3.5 micron (guard); Agilent SB-Aq 2.1x50mm 1.8 micron (analytical)
AC$CHROMATOGRAPHY: COLUMN_TEMPERATURE 60 C
AC$CHROMATOGRAPHY: FLOW_GRADIENT linear from 98A/2B at 0 min to 2A/98B at 13 min, hold 6 min at 2A/98B, reequilibration 98A/2B (5 min)
AC$CHROMATOGRAPHY: FLOW_RATE 0.6 ml/min
AC$CHROMATOGRAPHY: RETENTION_TIME 9.594
AC$CHROMATOGRAPHY: SOLVENT A water with 0.2% acetic acid
AC$CHROMATOGRAPHY: SOLVENT B methanol with 0.2% acetic acid

PK$SPLASH: splash10-000i-0090000000-1e1db7479a549b5c93c1
PK$NUM_PEAK: 1
PK$PEAK: m/z int. rel.int.
  237.0909765 43659535 999