ACCESSION: MSBNK-Washington_State_Univ-BML81840
RECORD_TITLE: O2,2'-Cyclouridine; LC-ESI-QTOF; MS; POSITIVE
DATE: 2016.01.19 (Created 2012.10.26)
AUTHORS: Cuthbertson DJ, Johnson SR, Lange BM, Institute of Biological Chemistry, Washington State University
LICENSE: CC BY-SA
COMMENT: relative retention time with respect to 9-anthracene Carboxylic Acid is 0.053

CH$NAME: O2,2'-Cyclouridine
CH$COMPOUND_CLASS: N/A
CH$FORMULA: C9H10N2O5
CH$EXACT_MASS: 226.058971
CH$SMILES: C1=CN2C3C(C(C(O3)CO)O)OC2=NC1=O
CH$IUPAC: InChI=1S/C9H10N2O5/c12-3-4-6(14)7-8(15-4)11-2-1-5(13)10-9(11)16-7/h1-2,4,6-8,12,14H,3H2
CH$LINK: CAS 3736-77-4
CH$LINK: CHEMSPIDER 89386
CH$LINK: PUBCHEM CID:98961
CH$LINK: INCHIKEY UUGITDASWNOAGG-UHFFFAOYSA-N

AC$INSTRUMENT: Agilent 1200 RRLC; Agilent 6520 QTOF
AC$INSTRUMENT_TYPE: LC-ESI-QTOF
AC$MASS_SPECTROMETRY: MS_TYPE MS
AC$MASS_SPECTROMETRY: ION_MODE POSITIVE
AC$MASS_SPECTROMETRY: SCANNING m/z 100-1000
AC$CHROMATOGRAPHY: COLUMN_NAME Agilent C8 Cartridge Column 2.1X30mm 3.5 micron (guard); Agilent SB-Aq 2.1x50mm 1.8 micron (analytical)
AC$CHROMATOGRAPHY: COLUMN_TEMPERATURE 60 C
AC$CHROMATOGRAPHY: FLOW_GRADIENT linear from 98A/2B at 0 min to 2A/98B at 13 min, hold 6 min at 2A/98B, reequilibration 98A/2B (5 min)
AC$CHROMATOGRAPHY: FLOW_RATE 0.6 ml/min
AC$CHROMATOGRAPHY: RETENTION_TIME 0.389
AC$CHROMATOGRAPHY: SOLVENT A water with 0.2% acetic acid
AC$CHROMATOGRAPHY: SOLVENT B methanol with 0.2% acetic acid

PK$SPLASH: splash10-004i-0090000000-aee3514d72e44c408934
PK$NUM_PEAK: 2
PK$PEAK: m/z int. rel.int.
  227.0662765 360384 999
  249.048218 4401 12