ACCESSION: MSBNK-PFOS_research_group-FFF00019
RECORD_TITLE: Epicoprostanol; LC-APPI-QQ; MS2; CE:30 V; [M-H2O+H]+
DATE: 2016.01.19 (Created 2011.01.24, modified 2011.06.20)
AUTHORS: Atsushi Yamamoto, PFOS.jp
LICENSE: CC BY-SA
COPYRIGHT: PFOS.jp
COMMENT: Disclaimer: While authors make an effort to ensure that the content of this record is accurate, the authors make no representations or warranties in relation to the accuracy or completeness of the record. This record do not reflect any viewpoints of the affiliation and organization to which the authors belong.

CH$NAME: Epicoprostanol
CH$COMPOUND_CLASS: Natural Product; Sterol
CH$FORMULA: C27H48O
CH$EXACT_MASS: 388.37052
CH$SMILES: CC(C4)(C(CC(O)C4)3)C(C2)C(CC3)C(C1)C(C)(C2)C(C(C)CCCC(C)C)C1
CH$IUPAC: InChI=1S/C27H48O/c1-18(2)7-6-8-19(3)23-11-12-24-22-10-9-20-17-21(28)13-15-26(20,4)25(22)14-16-27(23,24)5/h18-25,28H,6-17H2,1-5H3
CH$LINK: CAS 516-92-7
CH$LINK: LIPIDBANK SST0006
CH$LINK: INCHIKEY QYIXCDOBOSTCEI-UHFFFAOYSA-N

AC$INSTRUMENT: API2000, Applied
AC$INSTRUMENT_TYPE: LC-APPI-QQ
AC$MASS_SPECTROMETRY: MS_TYPE MS2
AC$MASS_SPECTROMETRY: ION_MODE POSITIVE
AC$CHROMATOGRAPHY: RETENTION_TIME 0.820850 min

MS$FOCUSED_ION: BASE_PEAK 108.800003
MS$FOCUSED_ION: PRECURSOR_M/Z 371.471000
MS$FOCUSED_ION: PRECURSOR_TYPE [M-H2O+H]+

PK$SPLASH: splash10-006t-4921000000-fee3bca84b6303fd0f0c
PK$NUM_PEAK: 321
PK$PEAK: m/z int. rel.int.
  40.799999 3701.000000 1
  41.200001 9252.500000 1
  41.599998 1850.500000 1
  42.900002 3701.000000 1
  43.299999 9252.500000 1
  43.599998 1850.500000 1
  52.850000 3701.000000 1
  53.299999 1850.500000 1
  54.900002 25907.000000 4
  55.194736 70319.000000 11
  55.850000 7402.000000 1
  57.075294 314585.000000 49
  63.900002 1850.500000 1
  64.099998 1850.500000 1
  64.900002 5551.500000 1
  65.400002 1850.500000 1
  65.599998 1850.500000 1
  67.115817 362698.000000 56
  69.073894 836426.000000 129
  71.039806 381203.000000 59
  72.300003 1850.500000 1
  72.500000 1850.500000 1
  72.699997 1850.500000 1
  72.900002 3701.000000 1
  73.099998 1850.500000 1
  73.400002 3701.000000 1
  73.599998 1850.500000 1
  76.728571 12953.500000 2
  77.300000 12953.500000 2
  77.699997 3701.000000 1
  78.971428 129535.000000 20
  81.077561 3216169.000000 497
  83.097727 1302752.000000 201
  85.132966 168395.500000 26
  86.049999 3701.000000 1
  86.400002 3701.000000 1
  87.400002 1850.500000 1
  88.800001 5551.500000 1
  89.400002 1850.500000 1
  89.750000 3701.000000 1
  90.199997 1850.500000 1
  91.200000 42561.500000 7
  93.100000 599562.000000 93
  95.029001 6463796.500000 999
  97.093140 1402679.000000 217
  98.300003 7402.000000 1
  98.599998 5551.500000 1
  98.850002 29608.000000 5
  99.099998 14804.000000 2
  99.400002 14804.000000 2
  99.699997 1850.500000 1
  100.400002 1850.500000 1
  100.900002 3701.000000 1
  101.099998 1850.500000 1
  101.300003 1850.500000 1
  102.800003 1850.500000 1
  103.300003 1850.500000 1
  103.549999 3701.000000 1
  103.900002 1850.500000 1
  104.099998 5551.500000 1
  104.988235 125834.000000 19
  107.044767 954858.000000 148
  109.054801 4953788.500000 766
  111.063095 1088094.000000 168
  112.099998 5551.500000 1
  112.500000 1850.500000 1
  112.800003 11103.000000 2
  113.400002 9252.500000 1
  114.199997 1850.500000 1
  115.400002 1850.500000 1
  116.800003 3701.000000 1
  117.000000 1850.500000 1
  117.199997 1850.500000 1
  117.549999 7402.000000 1
  117.950001 3701.000000 1
  118.400002 5551.500000 1
  119.106059 61066.500000 9
  121.060809 2105869.000000 325
  123.036955 2503726.500000 387
  125.074432 325688.000000 50
  125.900002 1850.500000 1
  126.649998 3701.000000 1
  127.028571 12953.500000 2
  127.300003 3701.000000 1
  128.299998 5551.500000 1
  128.650002 11103.000000 2
  129.087498 14804.000000 2
  129.600006 1850.500000 1
  130.000000 1850.500000 1
  130.199997 1850.500000 1
  130.699997 7402.000000 1
  130.899994 5551.500000 1
  131.225002 14804.000000 2
  131.674999 7402.000000 1
  133.106899 160993.500000 25
  133.621433 25907.000000 4
  135.042490 2883079.000000 446
  135.800003 22206.000000 3
  137.092767 1176918.000000 182
  137.874996 7402.000000 1
  138.699997 9252.500000 1
  139.226087 42561.500000 7
  141.399994 3701.000000 1
  142.600006 1850.500000 1
  142.899994 1850.500000 1
  143.199997 1850.500000 1
  144.100006 1850.500000 1
  145.105882 31458.500000 5
  145.700000 9252.500000 1
  146.050003 11103.000000 2
  146.300003 7402.000000 1
  147.111864 436718.000000 67
  149.073024 2949697.000000 456
  151.076316 703190.000000 109
  152.100001 5551.500000 1
  152.699997 5551.500000 1
  153.166667 11103.000000 2
  153.500000 5551.500000 1
  157.449997 3701.000000 1
  159.083333 44412.000000 7
  159.700001 20355.500000 3
  160.199999 12953.500000 2
  161.063351 353445.500000 55
  163.110256 2020746.000000 312
  165.151505 553299.500000 86
  165.800003 3701.000000 1
  166.199997 1850.500000 1
  167.100006 5551.500000 1
  170.899994 1850.500000 1
  171.199997 5551.500000 1
  172.600006 3701.000000 1
  172.800003 11103.000000 2
  173.033335 11103.000000 2
  173.500000 7402.000000 1
  173.775002 7402.000000 1
  174.000000 18505.000000 3
  175.051111 333090.000000 51
  176.022224 16654.500000 3
  176.300003 12953.500000 2
  177.159551 988167.000000 153
  178.199997 5551.500000 1
  179.188489 514439.000000 80
  180.200002 5551.500000 1
  181.300003 1850.500000 1
  183.399994 1850.500000 1
  184.949997 3701.000000 1
  185.299998 5551.500000 1
  185.899994 1850.500000 1
  187.075001 14804.000000 2
  187.399994 7402.000000 1
  187.600006 7402.000000 1
  188.087505 14804.000000 2
  189.152890 1280546.000000 198
  190.199997 16654.500000 3
  191.093636 407110.000000 63
  192.000000 1850.500000 1
  193.210452 531093.500000 82
  194.600001 5551.500000 1
  195.000000 7402.000000 1
  195.349998 3701.000000 1
  198.899994 1850.500000 1
  199.199997 3701.000000 1
  199.500000 1850.500000 1
  199.800003 1850.500000 1
  200.100006 1850.500000 1
  201.000003 11103.000000 2
  201.450005 14804.000000 2
  202.229999 18505.000000 3
  203.143568 891941.000000 138
  204.300003 9252.500000 1
  205.161289 344193.000000 53
  207.157879 610665.000000 94
  208.300003 3701.000000 1
  208.699997 1850.500000 1
  208.899994 1850.500000 1
  210.800003 1850.500000 1
  213.000000 1850.500000 1
  213.199997 3701.000000 1
  213.500000 1850.500000 1
  213.800003 3701.000000 1
  214.199997 1850.500000 1
  214.449997 3701.000000 1
  215.176667 222060.000000 34
  216.161039 284977.000000 44
  217.114914 421914.000000 65
  218.199997 11103.000000 2
  218.433329 11103.000000 2
  219.176922 288678.000000 45
  220.000000 3701.000000 1
  220.300003 3701.000000 1
  220.994117 62917.000000 10
  221.363634 101777.500000 16
  225.500000 1850.500000 1
  226.699997 1850.500000 1
  226.949997 3701.000000 1
  227.199997 1850.500000 1
  227.399994 3701.000000 1
  228.800003 5551.500000 1
  229.230769 24056.500000 4
  229.600006 5551.500000 1
  230.199997 16654.500000 3
  231.126548 418213.000000 65
  233.189583 355296.000000 55
  234.250000 3701.000000 1
  235.326189 77721.000000 12
  237.150002 7402.000000 1
  239.199997 1850.500000 1
  239.399994 1850.500000 1
  240.399994 1850.500000 1
  241.300003 9252.500000 1
  241.600006 1850.500000 1
  241.800003 3701.000000 1
  243.000000 3701.000000 1
  243.500000 7402.000000 1
  243.899994 1850.500000 1
  245.187273 203555.000000 31
  245.899994 5551.500000 1
  247.173684 421914.000000 65
  248.000000 1850.500000 1
  248.899994 9252.500000 1
  249.419997 37010.000000 6
  251.250000 3701.000000 1
  251.600006 1850.500000 1
  255.000000 1850.500000 1
  255.899994 1850.500000 1
  257.000000 3701.000000 1
  257.299994 9252.500000 1
  257.675011 7402.000000 1
  258.200012 7402.000000 1
  259.250000 266472.000000 41
  260.299988 3701.000000 1
  261.321753 484831.000000 75
  262.000000 1850.500000 1
  262.349991 3701.000000 1
  263.275999 46262.500000 7
  264.899994 1850.500000 1
  265.200012 1850.500000 1
  266.650009 3701.000000 1
  268.849991 3701.000000 1
  270.849991 3701.000000 1
  271.200012 3701.000000 1
  271.399994 1850.500000 1
  271.799988 1850.500000 1
  272.200012 1850.500000 1
  273.336983 135086.500000 21
  274.150009 3701.000000 1
  274.600006 5551.500000 1
  275.262810 447821.000000 69
  276.100006 5551.500000 1
  276.349991 3701.000000 1
  276.600006 1850.500000 1
  277.100006 1850.500000 1
  277.399994 7402.000000 1
  279.700012 1850.500000 1
  280.000000 1850.500000 1
  282.799988 1850.500000 1
  283.100006 1850.500000 1
  285.600006 1850.500000 1
  285.899994 1850.500000 1
  286.299988 3701.000000 1
  286.600006 1850.500000 1
  287.330381 146189.500000 23
  288.050003 7402.000000 1
  288.399994 5551.500000 1
  289.263078 240565.000000 37
  290.200012 1850.500000 1
  291.100006 1850.500000 1
  291.299988 1850.500000 1
  292.700012 1850.500000 1
  293.000000 1850.500000 1
  293.250000 3701.000000 1
  294.700012 1850.500000 1
  295.100006 1850.500000 1
  296.250000 3701.000000 1
  297.100006 1850.500000 1
  297.399994 1850.500000 1
  299.050003 3701.000000 1
  299.299988 1850.500000 1
  300.100006 3701.000000 1
  300.399994 5551.500000 1
  301.410526 70319.000000 11
  302.299988 1850.500000 1
  302.550003 3701.000000 1
  303.033335 22206.000000 3
  303.500000 9252.500000 1
  311.200012 1850.500000 1
  311.799988 1850.500000 1
  312.399994 1850.500000 1
  313.000000 1850.500000 1
  313.449997 7402.000000 1
  313.899994 1850.500000 1
  314.399994 7402.000000 1
  315.250574 160993.500000 25
  316.200012 3701.000000 1
  316.650009 3701.000000 1
  317.200012 1850.500000 1
  326.000000 1850.500000 1
  326.700012 1850.500000 1
  327.399994 1850.500000 1
  328.000000 5551.500000 1
  329.324989 7402.000000 1
  329.600006 3701.000000 1
  338.899994 1850.500000 1
  342.349991 3701.000000 1
  343.050003 7402.000000 1
  343.349991 3701.000000 1
  343.899994 3701.000000 1
  353.100006 9252.500000 1
  353.299988 5551.500000 1
  353.500000 3701.000000 1
  354.899994 1850.500000 1
  355.200012 3701.000000 1
  355.399994 1850.500000 1
  356.183337 22206.000000 3
  356.500000 11103.000000 2
  357.000000 1850.500000 1
  369.299988 1850.500000 1
  369.700012 1850.500000 1
  369.899994 3701.000000 1
  370.200012 5551.500000 1
  371.400734 5040762.000000 779