ACCESSION: MSBNK-PFOS_research_group-FFF00068
RECORD_TITLE: beta-Sitosterol; LC-APPI-QQ; MS2; CE:10 V; [M-H2O+H]+
DATE: 2016.01.19 (Created 2011.03.01, modified 2011.06.20)
AUTHORS: Atsushi Yamamoto, PFOS.jp
LICENSE: CC BY-SA
COPYRIGHT: PFOS.jp
COMMENT: Disclaimer: While authors make an effort to ensure that the content of this record is accurate, the authors make no representations or warranties in relation to the accuracy or completeness of the record. This record do not reflect any viewpoints of the affiliation and organization to which the authors belong.

CH$NAME: beta-Sitosterol
CH$COMPOUND_CLASS: Natural Product; Sterol
CH$FORMULA: C29H50O
CH$EXACT_MASS: 414.38617
CH$SMILES: C(C4)C(C(CC4O)=3)(C(C(CC3)2)CCC(C21)(C(CC1)C(C)CCC(C(C)C)CC)C)C
CH$IUPAC: InChI=1S/C29H50O/c1-7-21(19(2)3)9-8-20(4)25-12-13-26-24-11-10-22-18-23(30)14-16-28(22,5)27(24)15-17-29(25,26)6/h10,19-21,23-27,30H,7-9,11-18H2,1-6H3/t20?,21?,23-,24?,25?,26?,27?,28?,29?/m0/s1
CH$LINK: CAS 83-46-5
CH$LINK: LIPIDBANK SST9067
CH$LINK: INCHIKEY KZJWDPNRJALLNS-GDQWMHGZSA-N

AC$INSTRUMENT: API2000
AC$INSTRUMENT_TYPE: LC-APPI-QQ
AC$MASS_SPECTROMETRY: MS_TYPE MS2
AC$MASS_SPECTROMETRY: ION_MODE POSITIVE
AC$CHROMATOGRAPHY: RETENTION_TIME 0.820850 min

MS$FOCUSED_ION: BASE_PEAK 397.299988
MS$FOCUSED_ION: PRECURSOR_M/Z 397.600000
MS$FOCUSED_ION: PRECURSOR_TYPE [M-H2O+H]+

PK$SPLASH: splash10-0002-0219000000-2d036f5c909b18e37eec
PK$NUM_PEAK: 271
PK$PEAK: m/z int. rel.int.
  53.700001 2000.500000 1
  55.799999 4001.000000 1
  57.000000 2000.500000 1
  57.200001 2000.500000 1
  65.000000 2000.500000 1
  68.300003 2000.500000 1
  68.900002 2000.500000 1
  69.800003 2000.500000 1
  70.800003 4001.000000 1
  71.199997 6001.500000 2
  71.400002 2000.500000 1
  79.000000 4001.000000 1
  79.500000 4001.000000 1
  80.199997 2000.500000 1
  80.450001 4001.000000 1
  80.980000 20005.000000 6
  81.300003 2000.500000 1
  81.599998 2000.500000 1
  82.199997 4001.000000 1
  82.599998 2000.500000 1
  82.850002 4001.000000 1
  83.500000 2000.500000 1
  84.149998 4001.000000 1
  84.699997 2000.500000 1
  85.099998 2000.500000 1
  85.300003 4001.000000 1
  85.500000 2000.500000 1
  89.000000 2000.500000 1
  90.900002 2000.500000 1
  94.599998 8002.000000 2
  94.900002 10002.500000 3
  95.174997 8002.000000 2
  95.500000 2000.500000 1
  96.500000 4001.000000 1
  96.900002 8002.000000 2
  97.400002 4001.000000 1
  99.000000 4001.000000 1
  99.400002 2000.500000 1
  100.900002 4001.000000 1
  106.000000 2000.500000 1
  106.599998 4001.000000 1
  107.099998 8002.000000 2
  108.759999 10002.500000 3
  109.300003 20005.000000 6
  110.549999 4001.000000 1
  111.000000 6001.500000 2
  111.450001 8002.000000 2
  111.699997 4001.000000 1
  112.599998 2000.500000 1
  113.099998 4001.000000 1
  113.300003 2000.500000 1
  113.500000 2000.500000 1
  117.199997 2000.500000 1
  118.199997 2000.500000 1
  118.800003 4001.000000 1
  119.049999 4001.000000 1
  121.000000 14003.500000 4
  121.400002 6001.500000 2
  122.149998 4001.000000 1
  122.699997 4001.000000 1
  122.900002 4001.000000 1
  123.228571 14003.500000 4
  123.500000 2000.500000 1
  124.300003 2000.500000 1
  124.900002 4001.000000 1
  125.099998 8002.000000 2
  125.400002 4001.000000 1
  127.099998 2000.500000 1
  132.199997 2000.500000 1
  132.949997 8002.000000 2
  133.199997 2000.500000 1
  133.399994 4001.000000 1
  134.948145 54013.500000 15
  136.860001 10002.500000 3
  137.224998 8002.000000 2
  137.800003 2000.500000 1
  138.699997 10002.500000 3
  139.000000 4001.000000 1
  139.300003 2000.500000 1
  139.699997 2000.500000 1
  144.300003 2000.500000 1
  144.899994 2000.500000 1
  145.300003 2000.500000 1
  146.000000 4001.000000 1
  146.399994 8002.000000 2
  146.893750 64016.000000 18
  148.550003 12003.000000 3
  149.185715 28007.000000 8
  150.050003 4001.000000 1
  150.300003 2000.500000 1
  151.075005 8002.000000 2
  151.300003 6001.500000 2
  151.600006 2000.500000 1
  152.600006 2000.500000 1
  152.800003 4001.000000 1
  153.199997 2000.500000 1
  154.600006 2000.500000 1
  156.899994 2000.500000 1
  157.399994 2000.500000 1
  158.300003 2000.500000 1
  158.699997 2000.500000 1
  159.000000 4001.000000 1
  159.699997 4001.000000 1
  160.100006 4001.000000 1
  160.826924 52013.000000 15
  161.276744 86021.500000 24
  161.899994 4001.000000 1
  162.550003 4001.000000 1
  163.137503 16004.000000 5
  163.474998 8002.000000 2
  163.800003 2000.500000 1
  164.600006 2000.500000 1
  164.899994 2000.500000 1
  165.233332 12003.000000 3
  165.600006 4001.000000 1
  170.600006 2000.500000 1
  172.800003 6001.500000 2
  173.000000 6001.500000 2
  173.399994 2000.500000 1
  174.000000 2000.500000 1
  174.250000 4001.000000 1
  175.069998 40010.000000 11
  175.699997 6001.500000 2
  176.699997 4001.000000 1
  177.500000 4001.000000 1
  177.899994 2000.500000 1
  179.100006 4001.000000 1
  179.500000 8002.000000 2
  181.300003 2000.500000 1
  187.250000 4001.000000 1
  188.250000 4001.000000 1
  188.699997 10002.500000 3
  189.000000 22005.500000 6
  189.259999 40010.000000 11
  191.000000 2000.500000 1
  191.199997 2000.500000 1
  191.399994 6001.500000 2
  192.500000 2000.500000 1
  193.199997 2000.500000 1
  193.500000 2000.500000 1
  199.199997 2000.500000 1
  200.199997 2000.500000 1
  200.849998 16004.000000 5
  201.339996 10002.500000 3
  202.800003 14003.500000 4
  203.100006 10002.500000 3
  204.300003 2000.500000 1
  205.100006 2000.500000 1
  205.300003 2000.500000 1
  207.300003 6001.500000 2
  207.500000 4001.000000 1
  212.600006 2000.500000 1
  212.899994 8002.000000 2
  213.500000 2000.500000 1
  214.100006 2000.500000 1
  214.500000 2000.500000 1
  214.899994 16004.000000 5
  215.412498 32008.000000 9
  216.399994 2000.500000 1
  217.000000 4001.000000 1
  217.300001 14003.500000 4
  217.600006 6001.500000 2
  219.000000 2000.500000 1
  219.199997 2000.500000 1
  219.699997 2000.500000 1
  220.650002 4001.000000 1
  220.899994 2000.500000 1
  221.300003 6001.500000 2
  223.000000 4001.000000 1
  226.899994 2000.500000 1
  228.399994 4001.000000 1
  228.983332 12003.000000 3
  229.357143 28007.000000 8
  230.224998 8002.000000 2
  231.000000 2000.500000 1
  231.300003 4001.000000 1
  231.550003 4001.000000 1
  232.100006 2000.500000 1
  233.000000 4001.000000 1
  233.449999 16004.000000 5
  234.800003 2000.500000 1
  235.000000 2000.500000 1
  235.300003 2000.500000 1
  235.600006 2000.500000 1
  235.899994 4001.000000 1
  241.250000 4001.000000 1
  242.399994 2000.500000 1
  243.276190 42010.500000 12
  245.100006 6001.500000 2
  247.115386 26006.500000 7
  247.600006 6001.500000 2
  248.199997 2000.500000 1
  249.100006 4001.000000 1
  252.300003 4001.000000 1
  253.399994 2000.500000 1
  254.800003 2000.500000 1
  255.000000 2000.500000 1
  255.300003 4001.000000 1
  255.800003 2000.500000 1
  256.200012 4001.000000 1
  257.399994 30007.500000 8
  259.500000 2000.500000 1
  259.899994 2000.500000 1
  261.083338 24006.000000 7
  261.474998 16004.000000 5
  262.899994 2000.500000 1
  263.600006 2000.500000 1
  269.399994 2000.500000 1
  269.899994 2000.500000 1
  271.050003 4001.000000 1
  271.399994 6001.500000 2
  273.250000 4001.000000 1
  273.500000 6001.500000 2
  273.700012 2000.500000 1
  274.600006 2000.500000 1
  275.562504 16004.000000 5
  281.399994 2000.500000 1
  283.299988 2000.500000 1
  284.000000 2000.500000 1
  284.399994 4001.000000 1
  284.700012 2000.500000 1
  285.000000 2000.500000 1
  285.299988 12003.000000 3
  285.700012 4001.000000 1
  286.500000 2000.500000 1
  287.100006 14003.500000 4
  287.458331 24006.000000 7
  289.500000 8002.000000 2
  290.899994 2000.500000 1
  298.200012 2000.500000 1
  299.000000 4001.000000 1
  299.299988 10002.500000 3
  299.500000 8002.000000 2
  299.799988 2000.500000 1
  300.899994 4001.000000 1
  301.200012 4001.000000 1
  301.600006 14003.500000 4
  301.899994 6001.500000 2
  303.250000 4001.000000 1
  306.600006 2000.500000 1
  313.299998 6001.500000 2
  313.600006 10002.500000 3
  313.899994 2000.500000 1
  314.899994 2000.500000 1
  315.337498 32008.000000 9
  315.799988 2000.500000 1
  317.600006 2000.500000 1
  322.899994 2000.500000 1
  325.100006 4001.000000 1
  327.299988 4001.000000 1
  327.799988 4001.000000 1
  329.200012 2000.500000 1
  329.399994 2000.500000 1
  337.200012 2000.500000 1
  341.100006 4001.000000 1
  341.299988 4001.000000 1
  341.600006 4001.000000 1
  341.799988 2000.500000 1
  355.500000 4001.000000 1
  366.100006 2000.500000 1
  368.100006 2000.500000 1
  369.299988 2000.500000 1
  369.799988 2000.500000 1
  373.600006 2000.500000 1
  378.299988 2000.500000 1
  379.299988 4001.000000 1
  379.500000 2000.500000 1
  382.899994 2000.500000 1
  393.899994 4001.000000 1
  394.399994 4001.000000 1
  397.434995 3532883.000000 999