ACCESSION: MSBNK-PFOS_research_group-FFF00101
RECORD_TITLE: 24-Ethylcoprostanol; LC-APPI-QQ; MS2; CE:20 V; [M-H2O+H]+
DATE: 2016.01.19 (Created 2011.03.01, modified 2011.06.20)
AUTHORS: Atsushi Yamamoto, PFOS.jp
LICENSE: CC BY-SA
COPYRIGHT: PFOS.jp
COMMENT: Disclaimer: While authors make an effort to ensure that the content of this record is accurate, the authors make no representations or warranties in relation to the accuracy or completeness of the record. This record do not reflect any viewpoints of the affiliation and organization to which the authors belong.

CH$NAME: 24-Ethylcoprostanol
CH$COMPOUND_CLASS: Natural Product; Sterol
CH$FORMULA: C29H52O
CH$EXACT_MASS: 416.40182
CH$SMILES: C(C34[H])(CCC(O)C4)(C([H])(C([H])2CC3)CCC(C([H])12)(C)C(CC1)([H])C(CCC(C(C)C)CC)C)C
CH$IUPAC: InChI=1S/C29H52O/c1-7-21(19(2)3)9-8-20(4)25-12-13-26-24-11-10-22-18-23(30)14-16-28(22,5)27(24)15-17-29(25,26)6/h19-27,30H,7-18H2,1-6H3/t20-,21+,22-,23+,24+,25-,26+,27+,28+,29-/m1/s1
CH$LINK: CAS 4736-91-8
CH$LINK: INCHIKEY LGJMUZUPVCAVPU-RMEUMSAISA-N

AC$INSTRUMENT: API2000
AC$INSTRUMENT_TYPE: LC-APPI-QQ
AC$MASS_SPECTROMETRY: MS_TYPE MS2
AC$MASS_SPECTROMETRY: ION_MODE POSITIVE
AC$CHROMATOGRAPHY: RETENTION_TIME 0.820833 min

MS$FOCUSED_ION: BASE_PEAK 399.200012
MS$FOCUSED_ION: PRECURSOR_M/Z 399.500000
MS$FOCUSED_ION: PRECURSOR_TYPE [M-H2O+H]+

PK$SPLASH: splash10-0002-0319000000-e700ef059934a8137624
PK$NUM_PEAK: 312
PK$PEAK: m/z int. rel.int.
  40.500000 2000.500000 1
  41.000000 4001.000000 1
  42.799999 2000.500000 1
  43.799999 2000.500000 1
  44.099998 2000.500000 1
  44.299999 2000.500000 1
  45.062500 32008.000000 2
  45.425001 8002.000000 1
  54.650000 4001.000000 1
  55.100000 12003.000000 1
  55.500000 2000.500000 1
  56.599998 6001.500000 1
  56.900000 16004.000000 1
  57.299999 12003.000000 1
  58.799999 6001.500000 1
  64.800003 2000.500000 1
  65.199997 2000.500000 1
  66.199997 2000.500000 1
  66.549999 4001.000000 1
  66.900002 10002.500000 1
  69.037499 32008.000000 2
  69.699997 2000.500000 1
  70.049999 4001.000000 1
  70.450001 4001.000000 1
  71.043334 60015.000000 3
  71.800003 2000.500000 1
  73.099998 2000.500000 1
  78.099998 2000.500000 1
  78.599998 2000.500000 1
  79.000000 4001.000000 1
  79.699997 2000.500000 1
  80.000000 2000.500000 1
  80.199997 2000.500000 1
  80.919446 72018.000000 4
  82.149998 4001.000000 1
  82.500000 10002.500000 1
  82.986957 92023.000000 5
  83.500000 18004.500000 1
  84.300003 2000.500000 1
  84.937501 32008.000000 2
  85.266666 48012.000000 2
  85.699997 2000.500000 1
  87.099998 2000.500000 1
  90.699997 2000.500000 1
  90.900002 2000.500000 1
  91.099998 4001.000000 1
  92.199997 2000.500000 1
  92.500000 2000.500000 1
  93.000000 32008.000000 2
  93.599998 6001.500000 1
  93.800003 2000.500000 1
  95.026744 344086.000000 17
  95.900002 8002.000000 1
  97.167593 216054.000000 11
  99.189997 20005.000000 1
  99.400002 22005.500000 1
  99.975000 8002.000000 1
  100.699997 20005.000000 1
  101.123913 184046.000000 9
  103.900002 2000.500000 1
  104.800003 2000.500000 1
  105.049999 4001.000000 1
  105.400002 6001.500000 1
  105.900002 4001.000000 1
  106.199997 2000.500000 1
  106.616666 24006.000000 1
  107.079999 20005.000000 1
  107.422223 18004.500000 1
  108.972567 452113.000000 23
  110.300001 18004.500000 1
  111.054348 184046.000000 9
  113.000000 8002.000000 1
  113.400002 8002.000000 1
  115.199997 2000.500000 1
  118.500000 4001.000000 1
  119.000000 8002.000000 1
  119.500000 4001.000000 1
  121.054718 212053.000000 11
  123.071500 400100.000000 20
  123.699997 6001.500000 1
  123.900002 4001.000000 1
  125.151062 94023.500000 5
  126.900002 2000.500000 1
  127.099998 4001.000000 1
  127.400002 2000.500000 1
  128.800003 2000.500000 1
  129.100006 8002.000000 1
  132.600006 2000.500000 1
  132.800003 2000.500000 1
  133.100006 6001.500000 1
  133.300003 4001.000000 1
  133.600006 4001.000000 1
  134.125000 16004.000000 1
  135.078448 464116.000000 24
  135.866664 12003.000000 1
  136.283335 12003.000000 1
  137.146268 402100.500000 20
  138.300003 2000.500000 1
  139.075610 82020.500000 4
  140.699997 4001.000000 1
  142.699997 10002.500000 1
  143.099999 32008.000000 2
  144.849998 4001.000000 1
  145.233332 12003.000000 1
  145.550003 4001.000000 1
  146.300003 2000.500000 1
  147.217391 46011.500000 2
  147.699997 8002.000000 1
  149.144445 540135.000000 27
  149.800003 6001.500000 1
  150.199997 10002.500000 1
  151.170396 304076.000000 15
  152.399994 4001.000000 1
  152.800003 6001.500000 1
  153.166669 24006.000000 1
  154.899994 2000.500000 1
  160.199997 2000.500000 1
  161.275002 24006.000000 1
  161.800003 4001.000000 1
  162.487499 16004.000000 1
  163.188890 468117.000000 24
  164.199997 4001.000000 1
  165.178211 358089.500000 18
  166.600006 2000.500000 1
  166.899994 2000.500000 1
  167.300003 6001.500000 1
  169.500000 2000.500000 1
  172.399994 2000.500000 1
  174.250000 8002.000000 1
  175.137208 86021.500000 4
  175.849998 4001.000000 1
  176.100006 8002.000000 1
  177.216237 542135.500000 28
  178.300003 2000.500000 1
  179.165001 160040.000000 8
  179.899994 2000.500000 1
  180.300003 2000.500000 1
  180.699997 2000.500000 1
  181.349998 8002.000000 1
  187.199997 4001.000000 1
  187.849998 4001.000000 1
  189.164788 284071.000000 14
  190.300003 4001.000000 1
  191.159575 188047.000000 10
  192.300003 4001.000000 1
  192.500000 2000.500000 1
  193.259648 114028.500000 6
  193.800003 4001.000000 1
  194.000000 2000.500000 1
  195.000000 4001.000000 1
  195.300003 4001.000000 1
  195.500000 2000.500000 1
  196.449997 4001.000000 1
  197.500000 2000.500000 1
  199.102953 948237.000000 48
  201.100006 2000.500000 1
  201.899994 4001.000000 1
  202.150002 8002.000000 1
  202.399994 2000.500000 1
  203.176404 356089.000000 18
  204.000000 4001.000000 1
  204.199997 2000.500000 1
  204.399994 2000.500000 1
  205.360525 152038.000000 8
  207.220288 138034.500000 7
  207.699997 12003.000000 1
  208.100006 2000.500000 1
  208.899994 2000.500000 1
  209.100006 2000.500000 1
  209.300003 2000.500000 1
  213.500000 6001.500000 1
  214.933329 12003.000000 1
  215.224998 16004.000000 1
  216.000000 14003.500000 1
  216.437496 16004.000000 1
  217.230769 156039.000000 8
  218.399994 4001.000000 1
  218.600006 2000.500000 1
  219.217646 136034.000000 7
  219.800003 2000.500000 1
  220.100006 2000.500000 1
  221.248891 90022.500000 5
  222.300003 2000.500000 1
  225.136365 22005.500000 1
  225.500000 6001.500000 1
  226.800003 2000.500000 1
  227.399994 2000.500000 1
  227.600006 2000.500000 1
  229.550003 4001.000000 1
  230.199997 2000.500000 1
  230.500000 4001.000000 1
  231.193182 176044.000000 9
  232.300003 6001.500000 1
  232.800003 8002.000000 1
  233.000000 24006.000000 1
  233.199997 24006.000000 1
  235.309375 384096.000000 20
  236.100006 2000.500000 1
  237.699997 2000.500000 1
  241.300003 2000.500000 1
  242.974998 8002.000000 1
  243.349998 16004.000000 1
  244.000000 2000.500000 1
  244.349998 8002.000000 1
  244.600006 4001.000000 1
  245.009376 64016.000000 3
  245.385454 110027.500000 6
  247.204166 48012.000000 2
  247.899994 2000.500000 1
  249.270369 108027.000000 5
  254.949997 4001.000000 1
  255.199997 2000.500000 1
  256.700012 4001.000000 1
  256.899994 2000.500000 1
  257.100006 8002.000000 1
  257.324989 8002.000000 1
  258.000000 2000.500000 1
  258.200012 2000.500000 1
  258.683345 12003.000000 1
  259.285712 112028.000000 6
  260.449997 4001.000000 1
  261.185726 28007.000000 1
  261.433329 30007.500000 2
  262.150009 4001.000000 1
  262.600006 2000.500000 1
  263.253333 60015.000000 3
  263.899994 2000.500000 1
  269.299988 2000.500000 1
  269.500000 2000.500000 1
  270.899994 2000.500000 1
  271.299988 2000.500000 1
  273.472221 36009.000000 2
  274.500000 2000.500000 1
  275.415382 104026.000000 5
  276.200012 2000.500000 1
  276.500000 4001.000000 1
  277.342848 14003.500000 1
  277.700012 8002.000000 1
  284.500000 2000.500000 1
  285.399994 6001.500000 1
  285.849991 4001.000000 1
  286.150009 8002.000000 1
  287.186486 148037.000000 8
  288.100006 4001.000000 1
  288.500000 6001.500000 1
  289.374514 204051.000000 10
  291.100006 4001.000000 1
  291.600006 6001.500000 1
  291.799988 2000.500000 1
  292.299988 2000.500000 1
  293.100006 2000.500000 1
  295.600006 2000.500000 1
  297.000000 2000.500000 1
  297.299988 2000.500000 1
  298.100006 4001.000000 1
  299.213868 750187.500000 38
  300.200012 2000.500000 1
  300.399994 4001.000000 1
  301.288708 124031.000000 6
  302.200012 2000.500000 1
  302.399994 2000.500000 1
  303.314630 82020.500000 4
  305.349991 8002.000000 1
  305.700012 2000.500000 1
  313.399994 2000.500000 1
  315.259998 20005.000000 1
  315.564290 28007.000000 1
  317.214281 56014.000000 3
  317.500000 24006.000000 1
  325.200012 2000.500000 1
  327.600006 2000.500000 1
  328.200012 2000.500000 1
  328.399994 2000.500000 1
  328.799988 2000.500000 1
  329.344438 18004.500000 1
  329.633341 24006.000000 1
  330.399994 2000.500000 1
  331.340002 20005.000000 1
  341.000000 2000.500000 1
  341.200012 2000.500000 1
  342.299988 2000.500000 1
  343.394730 38009.500000 2
  349.299988 2000.500000 1
  356.600006 2000.500000 1
  357.299988 4001.000000 1
  357.500000 2000.500000 1
  363.700012 2000.500000 1
  365.600006 2000.500000 1
  368.899994 4001.000000 1
  370.299988 2000.500000 1
  371.100006 2000.500000 1
  371.299988 2000.500000 1
  381.200012 8002.000000 1
  381.600006 12003.000000 1
  382.000000 2000.500000 1
  383.899994 2000.500000 1
  384.299988 8002.000000 1
  384.500000 6001.500000 1
  384.700012 2000.500000 1
  384.899994 2000.500000 1
  396.200012 2000.500000 1
  396.650009 4001.000000 1
  397.050003 4001.000000 1
  397.299988 4001.000000 1
  397.600006 8002.000000 1
  398.000000 14003.500000 1
  399.420131 19676918.000000 999
  400.600006 6001.500000 1
  400.799988 2000.500000 1
  401.100006 2000.500000 1
  401.899994 2000.500000 1
  423.700012 2000.500000 1