ACCESSION: MSBNK-PFOS_research_group-FFF00139
RECORD_TITLE: 5-beta-Androstan-17-beta-ol-3-one; LC-APPI-QQ; MS2; CE:50 V; [M-H2O+H]+
DATE: 2016.01.19 (Created 2011.04.04, modified 2011.06.20)
AUTHORS: Atsushi Yamamoto, PFOS.jp
LICENSE: CC BY-SA
COPYRIGHT: PFOS.jp
COMMENT: Disclaimer: While authors make an effort to ensure that the content of this record is accurate, the authors make no representations or warranties in relation to the accuracy or completeness of the record. This record do not reflect any viewpoints of the affiliation and organization to which the authors belong.

CH$NAME: 5-beta-Androstan-17-beta-ol-3-one
CH$NAME: 5-beta-Dihydrotestosterone
CH$NAME: Etiocholane-17-beta-ol-3-one
CH$COMPOUND_CLASS: Natural Product; Steroid hormone
CH$FORMULA: C19H30O2
CH$EXACT_MASS: 290.22458
CH$SMILES: O=C(C4)CC([H])(C3)C(C)(C4)C(C2)C(C3)C(C1)C(C)(C2)C(O)C1
CH$IUPAC: InChI=1S/C19H30O2/c1-18-9-7-13(20)11-12(18)3-4-14-15-5-6-17(21)19(15,2)10-8-16(14)18/h12,14-17,21H,3-11H2,1-2H3/t12-,14?,15?,16?,17+,18?,19?/m1/s1
CH$LINK: CAS 571-22-2
CH$LINK: INCHIKEY NVKAWKQGWWIWPM-NOLKSFPRSA-N

AC$INSTRUMENT: API2000
AC$INSTRUMENT_TYPE: LC-APPI-QQ
AC$MASS_SPECTROMETRY: MS_TYPE MS2
AC$MASS_SPECTROMETRY: ION_MODE POSITIVE
AC$CHROMATOGRAPHY: RETENTION_TIME 0.820850 min

MS$FOCUSED_ION: BASE_PEAK 91.199997
MS$FOCUSED_ION: PRECURSOR_M/Z 273.100000
MS$FOCUSED_ION: PRECURSOR_TYPE [M-H2O+H]+

PK$SPLASH: splash10-05nf-9700000000-eb8f9e98af0fe28de6c3
PK$NUM_PEAK: 247
PK$PEAK: m/z int. rel.int.
  38.700001 1850.500000 1
  38.900002 3701.000000 1
  39.400002 3701.000000 1
  40.299999 3701.000000 1
  41.224999 44412.000000 9
  42.200001 7402.000000 2
  42.420001 18505.000000 4
  43.051111 166545.000000 35
  43.700001 1850.500000 1
  43.900002 1850.500000 1
  44.200001 1850.500000 1
  45.099998 1850.500000 1
  51.250000 7402.000000 2
  52.400002 1850.500000 1
  52.940001 27757.500000 6
  53.333333 22206.000000 5
  55.081538 962260.000000 202
  56.060000 9252.500000 2
  57.123333 222060.000000 47
  57.700001 1850.500000 1
  58.000000 1850.500000 1
  58.799999 1850.500000 1
  59.599998 1850.500000 1
  63.799999 3701.000000 1
  64.149998 3701.000000 1
  64.902631 70319.000000 15
  67.132147 3068129.000000 645
  69.121165 603263.000000 127
  70.000000 3701.000000 1
  70.400002 3701.000000 1
  70.988235 31458.500000 7
  71.300003 20355.500000 4
  73.300003 1850.500000 1
  74.800003 1850.500000 1
  75.199997 1850.500000 1
  77.067331 928951.000000 195
  79.051184 3673242.500000 773
  81.121947 3878648.000000 816
  82.350002 29608.000000 6
  83.139506 299781.000000 63
  84.199997 1850.500000 1
  84.500000 7402.000000 2
  85.162498 14804.000000 3
  87.000000 1850.500000 1
  88.099998 1850.500000 1
  88.600000 9252.500000 2
  89.400002 12953.500000 3
  89.699997 33309.000000 7
  91.066786 4134017.000000 870
  93.106498 4385685.000000 923
  95.069070 3003361.500000 632
  97.130527 351595.000000 74
  98.000000 5551.500000 1
  98.350002 7402.000000 2
  99.049999 7402.000000 2
  99.400002 1850.500000 1
  100.000000 3701.000000 1
  102.240001 9252.500000 2
  103.054412 125834.000000 26
  105.077943 4748383.000000 999
  107.080135 1639543.000000 345
  107.900002 24056.500000 5
  109.100000 899343.000000 189
  110.099998 11103.000000 2
  110.539999 9252.500000 2
  111.191665 44412.000000 9
  112.400002 1850.500000 1
  112.800003 1850.500000 1
  113.800003 3701.000000 1
  114.099998 3701.000000 1
  115.080702 210957.000000 44
  117.096621 1095496.000000 230
  119.110799 1713563.000000 361
  121.071680 418213.000000 88
  123.033333 233163.000000 49
  123.699997 5551.500000 1
  124.000000 1850.500000 1
  124.199997 1850.500000 1
  124.549999 3701.000000 1
  125.199997 5551.500000 1
  127.225000 59216.000000 12
  129.124584 557000.500000 117
  130.218605 477429.000000 100
  131.133570 1300901.500000 274
  133.143148 729097.000000 153
  134.000000 5551.500000 1
  134.426667 27757.500000 6
  135.143219 436718.000000 92
  136.300003 1850.500000 1
  137.114284 25907.000000 5
  139.100000 9252.500000 2
  139.699997 1850.500000 1
  140.300003 5551.500000 1
  140.831575 35159.500000 7
  141.233332 55515.000000 12
  142.150001 181349.000000 38
  143.103922 566253.000000 119
  145.103800 1071439.500000 225
  147.154746 507037.000000 107
  148.050003 11103.000000 2
  148.333333 11103.000000 2
  149.189998 37010.000000 8
  149.899994 1850.500000 1
  150.500000 1850.500000 1
  151.040002 9252.500000 2
  151.300003 7402.000000 2
  152.166667 11103.000000 2
  153.199997 9252.500000 2
  154.050003 11103.000000 2
  154.918182 81422.000000 17
  155.800003 22206.000000 5
  157.148705 357146.500000 75
  159.167130 799416.000000 168
  161.174674 284977.000000 60
  162.100006 3701.000000 1
  163.077777 33309.000000 7
  164.199997 5551.500000 1
  164.799995 7402.000000 2
  165.100006 1850.500000 1
  165.300003 3701.000000 1
  166.325001 7402.000000 2
  166.800003 5551.500000 1
  167.300003 3701.000000 1
  167.500000 1850.500000 1
  167.799995 7402.000000 2
  169.047369 105478.500000 22
  171.083702 249817.500000 53
  172.100006 14804.000000 3
  173.192856 207256.000000 44
  173.800003 3701.000000 1
  174.000000 1850.500000 1
  174.399999 5551.500000 1
  175.030002 18505.000000 4
  175.800003 1850.500000 1
  176.300003 5551.500000 1
  177.035715 25907.000000 5
  177.600006 1850.500000 1
  178.349998 7402.000000 2
  178.699997 1850.500000 1
  179.299995 7402.000000 2
  180.000000 1850.500000 1
  180.899999 5551.500000 1
  181.199997 3701.000000 1
  181.500000 1850.500000 1
  181.699997 1850.500000 1
  182.100006 5551.500000 1
  182.300003 7402.000000 2
  182.938885 33309.000000 7
  183.291664 44412.000000 9
  184.100006 18505.000000 4
  184.375998 46262.500000 10
  185.274000 277575.000000 58
  186.300003 20355.500000 4
  186.800003 9252.500000 2
  187.113793 53664.500000 11
  187.399994 24056.500000 5
  187.899994 5551.500000 1
  188.200003 25907.000000 5
  189.058696 170246.000000 36
  190.000000 7402.000000 2
  190.325001 7402.000000 2
  191.000000 9252.500000 2
  191.399994 5551.500000 1
  192.300003 1850.500000 1
  192.500000 1850.500000 1
  193.100006 1850.500000 1
  195.199997 1850.500000 1
  195.699997 1850.500000 1
  195.899994 1850.500000 1
  196.100006 3701.000000 1
  196.500000 1850.500000 1
  197.100002 20355.500000 4
  197.466665 22206.000000 5
  197.900002 14804.000000 3
  198.344442 33309.000000 7
  199.218097 194302.500000 41
  200.123999 46262.500000 10
  200.800003 16654.500000 4
  202.120370 399708.000000 84
  203.100006 5551.500000 1
  203.500000 3701.000000 1
  205.300003 1850.500000 1
  206.199997 1850.500000 1
  208.349998 3701.000000 1
  210.000000 1850.500000 1
  210.199997 1850.500000 1
  210.449997 3701.000000 1
  210.699997 1850.500000 1
  211.211765 31458.500000 7
  211.699997 3701.000000 1
  212.000000 9252.500000 2
  213.099998 59216.000000 12
  214.283335 11103.000000 2
  214.500000 9252.500000 2
  215.087891 473728.000000 100
  216.084614 48113.000000 10
  216.437496 14804.000000 3
  217.171873 59216.000000 12
  221.600006 3701.000000 1
  222.899994 1850.500000 1
  223.399994 1850.500000 1
  223.899994 1850.500000 1
  224.449997 3701.000000 1
  224.775002 7402.000000 2
  225.156523 42561.500000 9
  226.090000 148040.000000 31
  227.218180 40711.000000 9
  227.943747 29608.000000 6
  228.400001 20355.500000 4
  228.972726 40711.000000 9
  229.261539 48113.000000 10
  230.056249 59216.000000 12
  231.349998 7402.000000 2
  237.000000 1850.500000 1
  238.600006 3701.000000 1
  238.946152 24056.500000 5
  239.699997 1850.500000 1
  239.983332 11103.000000 2
  240.300003 5551.500000 1
  240.500000 11103.000000 2
  241.000000 1850.500000 1
  241.250000 7402.000000 2
  241.500000 1850.500000 1
  242.087505 14804.000000 3
  242.500000 9252.500000 2
  242.899994 11103.000000 2
  243.100006 5551.500000 1
  244.214290 25907.000000 5
  244.800003 12953.500000 3
  245.100002 51814.000000 11
  245.399994 22206.000000 5
  249.100006 20355.500000 4
  251.300003 1850.500000 1
  253.250000 3701.000000 1
  254.300003 1850.500000 1
  255.357501 74020.000000 16
  257.066671 11103.000000 2
  257.374992 14804.000000 3
  258.309995 37010.000000 8
  270.000000 1850.500000 1
  270.600006 1850.500000 1
  271.133331 11103.000000 2
  272.000000 11103.000000 2
  272.299988 1850.500000 1
  272.899994 5551.500000 1
  273.133341 11103.000000 2
  355.100006 1850.500000 1