ACCESSION: MSBNK-PFOS_research_group-FFF00187
RECORD_TITLE: Epiandrosterone; LC-APPI-QQ; MS2; CE:50 V; [M-2H2O+H]+
DATE: 2016.01.19 (Created 2011.04.05, modified 2011.06.20)
AUTHORS: Atsushi Yamamoto, PFOS.jp
LICENSE: CC BY-SA
COPYRIGHT: PFOS.jp
COMMENT: Disclaimer: While authors make an effort to ensure that the content of this record is accurate, the authors make no representations or warranties in relation to the accuracy or completeness of the record. This record do not reflect any viewpoints of the affiliation and organization to which the authors belong.

CH$NAME: Epiandrosterone
CH$NAME: 3-beta-Hydroxy-5alpha-androstan-17-one
CH$COMPOUND_CLASS: Natural Product; Steroid hormone
CH$FORMULA: C19H30O2
CH$EXACT_MASS: 290.22458
CH$SMILES: OC(C4)CC([H])(C3)C(C)(C4)C(C2)C(C3)C(C1)C(C)(C2)C(=O)C1
CH$IUPAC: InChI=1S/C19H30O2/c1-18-9-7-13(20)11-12(18)3-4-14-15-5-6-17(21)19(15,2)10-8-16(14)18/h12-16,20H,3-11H2,1-2H3/t12-,13-,14?,15?,16?,18?,19?/m0/s1
CH$LINK: CAS 481-29-8
CH$LINK: LIPIDBANK SST0205
CH$LINK: INCHIKEY QGXBDMJGAMFCBF-CYFBJHQBSA-N

AC$INSTRUMENT: API2000
AC$INSTRUMENT_TYPE: LC-APPI-QQ
AC$MASS_SPECTROMETRY: MS_TYPE MS2
AC$MASS_SPECTROMETRY: ION_MODE POSITIVE
AC$CHROMATOGRAPHY: RETENTION_TIME 0.820850 min

MS$FOCUSED_ION: BASE_PEAK 91.000000
MS$FOCUSED_ION: PRECURSOR_M/Z 255.300000
MS$FOCUSED_ION: PRECURSOR_TYPE [M-2H2O+H]+

PK$SPLASH: splash10-05nf-9800000000-7533b5262df3a8328ad2
PK$NUM_PEAK: 216
PK$PEAK: m/z int. rel.int.
  38.450001 5402.000000 1
  39.062500 21608.000000 1
  41.107675 615828.000000 29
  41.925001 5402.000000 1
  43.103603 299811.000000 14
  44.799999 1350.500000 1
  45.200001 1350.500000 1
  49.850000 2701.000000 1
  50.299999 1350.500000 1
  50.500000 4051.500000 1
  50.700001 4051.500000 1
  50.957144 18907.000000 1
  53.071053 307914.000000 15
  55.082431 5365536.500000 253
  56.231250 21608.000000 1
  57.102778 97236.000000 5
  57.799999 1350.500000 1
  58.500000 1350.500000 1
  58.700001 1350.500000 1
  59.000000 1350.500000 1
  61.299999 2701.000000 1
  61.900002 1350.500000 1
  62.650000 2701.000000 1
  63.099998 2701.000000 1
  63.299999 1350.500000 1
  63.500000 1350.500000 1
  65.090625 691456.000000 33
  67.118251 11706134.000000 552
  69.119021 1902854.500000 90
  70.500000 1350.500000 1
  71.099998 4051.500000 1
  71.400002 2701.000000 1
  72.800003 1350.500000 1
  73.350002 2701.000000 1
  73.750000 2701.000000 1
  74.025000 5402.000000 1
  74.450001 2701.000000 1
  74.933334 16206.000000 1
  77.061537 5203476.500000 245
  79.044058 15682006.000000 740
  81.108288 16002074.500000 755
  83.123720 1081750.500000 51
  84.300003 2701.000000 1
  84.599998 1350.500000 1
  85.099998 1350.500000 1
  85.400002 1350.500000 1
  85.900002 4051.500000 1
  86.250000 2701.000000 1
  86.599998 1350.500000 1
  86.900002 1350.500000 1
  87.674997 5402.000000 1
  88.099998 5402.000000 1
  91.064259 21182592.500000 999
  93.107238 10859370.500000 512
  95.069862 6452689.000000 304
  96.199997 5402.000000 1
  96.599998 1350.500000 1
  96.800003 4051.500000 1
  97.116666 32412.000000 2
  97.525000 5402.000000 1
  98.400002 1350.500000 1
  99.199997 1350.500000 1
  99.800003 1350.500000 1
  100.000000 1350.500000 1
  101.099998 2701.000000 1
  101.300003 5402.000000 1
  102.099998 27010.000000 1
  103.086308 1104709.000000 52
  105.048155 20859823.000000 984
  107.059471 3878636.000000 183
  109.124206 1020978.000000 48
  110.099998 1350.500000 1
  110.750000 2701.000000 1
  111.199999 4051.500000 1
  111.500000 1350.500000 1
  111.900002 1350.500000 1
  112.599998 1350.500000 1
  112.800003 4051.500000 1
  115.088156 1801567.000000 85
  117.092197 5434412.000000 256
  119.073647 5591070.000000 264
  121.112612 749527.500000 35
  122.199997 1350.500000 1
  123.079999 67525.000000 3
  124.000000 1350.500000 1
  124.199997 1350.500000 1
  124.500000 1350.500000 1
  124.850002 2701.000000 1
  125.149998 2701.000000 1
  125.525000 5402.000000 1
  128.106498 2910327.500000 137
  129.082364 5130549.500000 242
  131.144247 6525616.000000 308
  133.133160 1812371.000000 85
  135.147143 378140.000000 18
  135.800003 1350.500000 1
  136.399994 1350.500000 1
  136.600006 1350.500000 1
  137.100006 4051.500000 1
  137.699997 1350.500000 1
  139.025925 36463.500000 2
  139.537502 10804.000000 1
  141.147369 1026380.000000 48
  142.109541 1882597.000000 89
  143.103865 4752409.500000 224
  145.113086 6996940.500000 330
  147.154881 1245161.000000 59
  147.800003 5402.000000 1
  148.240002 6752.500000 1
  149.174489 132349.000000 6
  150.050003 2701.000000 1
  150.300003 2701.000000 1
  150.600006 1350.500000 1
  151.100006 5402.000000 1
  151.449997 2701.000000 1
  153.006757 99937.000000 5
  155.068114 902134.000000 43
  157.150438 2926533.500000 138
  158.195990 471324.500000 22
  159.137367 2287747.000000 108
  161.135257 865670.500000 41
  162.199997 5402.000000 1
  162.600006 4051.500000 1
  162.800003 6752.500000 1
  163.000000 4051.500000 1
  163.299995 5402.000000 1
  163.600006 2701.000000 1
  163.800003 1350.500000 1
  164.800003 8103.000000 1
  165.221053 25659.500000 1
  165.800003 8103.000000 1
  166.266668 8103.000000 1
  167.134042 126947.000000 6
  169.133591 876474.500000 41
  171.096333 2062213.500000 97
  173.186473 1018277.000000 48
  174.233332 8103.000000 1
  174.600006 6752.500000 1
  175.300003 22958.500000 1
  176.100006 1350.500000 1
  176.899994 1350.500000 1
  177.100006 2701.000000 1
  177.399994 2701.000000 1
  177.849998 2701.000000 1
  178.150002 2701.000000 1
  178.399994 1350.500000 1
  178.766663 8103.000000 1
  179.250000 5402.000000 1
  179.974998 5402.000000 1
  180.300003 2701.000000 1
  181.144001 67525.000000 3
  182.284209 102638.000000 5
  183.179847 529396.000000 25
  185.176316 1642208.000000 77
  186.208696 155307.500000 7
  187.158975 210678.000000 10
  188.399994 4051.500000 1
  189.244999 54020.000000 3
  189.699997 2701.000000 1
  190.699997 2701.000000 1
  191.399994 1350.500000 1
  192.825001 5402.000000 1
  193.199997 2701.000000 1
  193.399994 2701.000000 1
  193.899994 2701.000000 1
  194.100006 6752.500000 1
  194.399994 2701.000000 1
  194.699997 1350.500000 1
  195.160715 37814.000000 2
  196.409998 27010.000000 1
  197.189928 375439.000000 18
  198.188680 143153.000000 7
  199.211125 1068245.500000 50
  200.127501 108040.000000 5
  201.093105 78329.000000 4
  202.000000 1350.500000 1
  203.600006 1350.500000 1
  206.300003 1350.500000 1
  207.300003 4051.500000 1
  208.100006 1350.500000 1
  208.500000 1350.500000 1
  208.699997 1350.500000 1
  209.050003 8103.000000 1
  209.300003 1350.500000 1
  209.650002 2701.000000 1
  209.899994 6752.500000 1
  210.199997 4051.500000 1
  211.190955 268749.500000 13
  212.285002 27010.000000 1
  213.272438 171513.500000 8
  214.191664 16206.000000 1
  214.558337 16206.000000 1
  219.800003 1350.500000 1
  220.000000 1350.500000 1
  221.050003 2701.000000 1
  221.899994 1350.500000 1
  222.849998 2701.000000 1
  223.399994 9453.500000 1
  224.150002 5402.000000 1
  224.449997 5402.000000 1
  225.219643 302512.000000 14
  226.130062 220131.500000 10
  227.249999 81030.000000 4
  236.199997 1350.500000 1
  236.899994 1350.500000 1
  237.699997 2701.000000 1
  238.600006 1350.500000 1
  239.277778 24309.000000 1
  240.411106 24309.000000 1
  252.300003 1350.500000 1
  252.500000 1350.500000 1
  252.800003 2701.000000 1
  253.199997 6752.500000 1
  254.100006 2701.000000 1
  255.289473 153957.000000 7
  257.100006 1350.500000 1