ACCESSION: MSBNK-PFOS_research_group-FFF00212
RECORD_TITLE: Dihydrotestosterone; LC-APPI-QQ; MS2; CE:10 V; [M+H]+
DATE: 2016.01.19 (Created 2011.04.05, modified 2011.06.20)
AUTHORS: Atsushi Yamamoto, PFOS.jp
LICENSE: CC BY-SA
COPYRIGHT: PFOS.jp
COMMENT: Disclaimer: While authors make an effort to ensure that the content of this record is accurate, the authors make no representations or warranties in relation to the accuracy or completeness of the record. This record do not reflect any viewpoints of the affiliation and organization to which the authors belong.

CH$NAME: Dihydrotestosterone
CH$COMPOUND_CLASS: Natural Product; Steroid hormone
CH$FORMULA: C19H30O2
CH$EXACT_MASS: 290.22458
CH$SMILES: O=C(C4)CC([H])(C3)C(C)(C4)C(C2)C(C3)C(C1)C(C)(C2)C(O)C1
CH$IUPAC: InChI=1S/C19H30O2/c1-18-9-7-13(20)11-12(18)3-4-14-15-5-6-17(21)19(15,2)10-8-16(14)18/h12,14-17,21H,3-11H2,1-2H3/t12-,14?,15?,16?,17-,18?,19?/m0/s1
CH$LINK: CAS 521-18-6
CH$LINK: LIPIDBANK SST0297
CH$LINK: INCHIKEY NVKAWKQGWWIWPM-FMFZMMAASA-N

AC$INSTRUMENT: API2000
AC$INSTRUMENT_TYPE: LC-APPI-QQ
AC$MASS_SPECTROMETRY: MS_TYPE MS2
AC$MASS_SPECTROMETRY: ION_MODE POSITIVE
AC$CHROMATOGRAPHY: RETENTION_TIME 0.820833 min

MS$FOCUSED_ION: BASE_PEAK 291.100006
MS$FOCUSED_ION: PRECURSOR_M/Z 291.300000
MS$FOCUSED_ION: PRECURSOR_TYPE [M+H]+

PK$SPLASH: splash10-0006-0090000000-c6e983bb8b4cb05c804b
PK$NUM_PEAK: 105
PK$PEAK: m/z int. rel.int.
  80.500000 1350.500000 1
  81.199997 1350.500000 1
  90.800003 1350.500000 1
  91.000000 1350.500000 1
  98.900002 1350.500000 1
  100.900002 1350.500000 1
  104.699997 1350.500000 1
  104.900002 1350.500000 1
  106.800003 2701.000000 2
  107.400002 2701.000000 2
  109.199997 1350.500000 1
  120.800003 1350.500000 1
  127.000000 1350.500000 1
  129.100006 1350.500000 1
  131.199997 1350.500000 1
  132.800003 1350.500000 1
  135.000000 1350.500000 1
  139.199997 1350.500000 1
  143.899994 1350.500000 1
  144.899994 5402.000000 4
  145.500000 1350.500000 1
  147.100006 2701.000000 2
  150.800003 1350.500000 1
  156.899994 1350.500000 1
  158.000000 1350.500000 1
  159.000000 4051.500000 3
  159.300003 1350.500000 1
  163.100006 1350.500000 1
  164.899994 1350.500000 1
  165.100006 1350.500000 1
  167.199997 1350.500000 1
  171.300003 1350.500000 1
  171.500000 1350.500000 1
  172.500000 1350.500000 1
  172.699997 1350.500000 1
  173.349998 5402.000000 4
  174.699997 2701.000000 2
  177.100006 1350.500000 1
  177.399994 1350.500000 1
  182.399994 1350.500000 1
  182.899994 1350.500000 1
  183.250000 2701.000000 2
  184.399994 1350.500000 1
  184.699997 1350.500000 1
  185.100001 8103.000000 6
  185.399994 1350.500000 1
  187.000000 1350.500000 1
  196.750000 2701.000000 2
  197.000000 2701.000000 2
  197.199997 2701.000000 2
  198.100006 1350.500000 1
  199.062504 21608.000000 17
  199.399994 6752.500000 5
  199.899994 2701.000000 2
  200.750000 2701.000000 2
  201.199997 1350.500000 1
  201.449997 2701.000000 2
  203.000000 2701.000000 2
  205.399994 1350.500000 1
  207.199997 1350.500000 1
  209.100006 1350.500000 1
  213.000000 4051.500000 3
  213.500000 1350.500000 1
  214.000000 1350.500000 1
  214.600006 1350.500000 1
  215.100006 5402.000000 4
  215.424995 5402.000000 4
  217.100006 4051.500000 3
  218.699997 1350.500000 1
  219.399994 1350.500000 1
  225.699997 1350.500000 1
  226.899994 1350.500000 1
  227.199997 1350.500000 1
  228.199997 1350.500000 1
  228.899994 1350.500000 1
  229.100006 1350.500000 1
  229.449997 2701.000000 2
  231.000000 4051.500000 3
  231.300003 1350.500000 1
  231.500000 1350.500000 1
  232.699997 1350.500000 1
  233.500000 1350.500000 1
  235.199997 2701.000000 2
  237.600006 1350.500000 1
  241.399994 1350.500000 1
  244.399994 1350.500000 1
  245.050003 2701.000000 2
  245.600001 8103.000000 6
  249.100006 1350.500000 1
  254.000000 1350.500000 1
  254.399994 1350.500000 1
  254.699997 8103.000000 6
  255.275002 64824.000000 51
  256.100006 1350.500000 1
  258.899994 4051.500000 3
  259.315383 17556.500000 14
  263.100006 5402.000000 4
  273.172233 24309.000000 19
  273.799988 1350.500000 1
  276.100006 1350.500000 1
  288.200012 1350.500000 1
  289.399994 1350.500000 1
  289.899994 2701.000000 2
  290.200012 2701.000000 2
  291.315727 1270820.500000 999