ACCESSION: MSBNK-PFOS_research_group-FFF00356
RECORD_TITLE: 5mPFOA; LC-ESI-QQ; MS2; CE50eV
DATE: 2016.01.19 (Created 2012.06.13)
AUTHORS: Atsushi Yamamoto
LICENSE: CC BY-SA
COPYRIGHT: PFOS.jp
COMMENT: Disclaimer: While authors make an effort to ensure that the content of this record is accurate, the authors make no representations or warranties in relation to the accuracy or completeness of the record. This record do not reflect any viewpoints of the affiliation and organization to which the authors belong.

CH$NAME: 5mPFOA
CH$COMPOUND_CLASS: Non-Natural Product
CH$FORMULA: C8HF15O2
CH$EXACT_MASS: 413.97370
CH$SMILES: OC(=O)C(F)(F)C(F)(F)C(F)(F)C(F)(C(F)(F)F)C(F)(F)C(F)(F)F
CH$IUPAC: InChI=1S/C8HF15O2/c9-2(10,1(24)25)4(12,13)5(14,15)3(11,7(18,19)20)6(16,17)8(21,22)23/h(H,24,25)
CH$LINK: INCHIKEY HDWNCRCOUUAYQG-UHFFFAOYSA-N
CH$LINK: COMPTOX DTXSID50896596

AC$INSTRUMENT: Xevo TQ, Waters
AC$INSTRUMENT_TYPE: LC-ESI-QQ
AC$MASS_SPECTROMETRY: MS_TYPE MS2
AC$MASS_SPECTROMETRY: ION_MODE NEGATIVE
AC$MASS_SPECTROMETRY: COLLISION_ENERGY 50eV
AC$CHROMATOGRAPHY: RETENTION_TIME 15.704717 min

MS$FOCUSED_ION: BASE_PEAK 69.246590
MS$FOCUSED_ION: PRECURSOR_M/Z 413
MS$FOCUSED_ION: PRECURSOR_TYPE [M-H]-

PK$SPLASH: splash10-014i-9700000000-ddc55462ececc8fb15e2
PK$NUM_PEAK: 4
PK$PEAK: m/z int. rel.int.
  69.247166 8167.228577 999
  118.620158 4413.130950 540
  128.077129 1132.125753 138
  197.012041 1274.604805 156