ACCESSION: MSBNK-GL_Sciences_Inc-GLS00040
RECORD_TITLE: 2-Isopropylmalic acid; EI-B; MS; 3 TMS; RT: 630.32 s
DATE: 2016.01.19 (Created 2012.08.03, modified 2013.07.31)
AUTHORS: Miyagawa H, Akimoto S, Yamasaki K, GL Sciences Inc.
LICENSE: CC BY-SA
COPYRIGHT: GL Sciences Inc.
COMMENT: The chemical compound was chemically modified with N-methyl-N-trimethylsilyl-trifluoroacetamide(MSTFA) before GC-MS analysis. When it has two or more functional groups, this modification gave a mixture of the TMS derivatives having different number of TMS groups at different functional groups.

CH$NAME: 2-Isopropylmalic acid
CH$COMPOUND_CLASS: Natural Product
CH$FORMULA: C7H12O5
CH$EXACT_MASS: 176.06847
CH$SMILES: OC(=O)CC(O)(C(C)C)C(O)=O
CH$IUPAC: InChI=1S/C7H12O5/c1-4(2)7(12,6(10)11)3-5(8)9/h4,12H,3H2,1-2H3,(H,8,9)(H,10,11)
CH$LINK: CAS 3237-44-3
CH$LINK: INCHIKEY BITYXLXUCSKTJS-UHFFFAOYSA-N

AC$INSTRUMENT: GCMS-2010 Plus, Shimadzu
AC$INSTRUMENT_TYPE: EI-B
AC$MASS_SPECTROMETRY: MS_TYPE MS
AC$MASS_SPECTROMETRY: ION_MODE POSITIVE
AC$MASS_SPECTROMETRY: GAS_PRESSURE 75 kPa
AC$MASS_SPECTROMETRY: ION_SOURCE_TEMPERATURE 200 C
AC$MASS_SPECTROMETRY: SCAN_RANGE_M/Z 85-500
AC$CHROMATOGRAPHY: COLUMN_NAME InertCap 5MS/NP 0.25 mmI.D. x 30 m, df=0.25 um
AC$CHROMATOGRAPHY: INJECTION_TEMPERATURE 230 C
AC$CHROMATOGRAPHY: OVEN_TEMPERATURE 80 C(2 min)-15 C/min - 330C
AC$CHROMATOGRAPHY: RETENTION_INDEX 1595
AC$CHROMATOGRAPHY: RETENTION_TIME 630.32
AC$CHROMATOGRAPHY: TRANSFARLINE_TEMPERATURE 250 C

MS$FOCUSED_ION: DERIVATIVE_TYPE 3 TMS
MS$DATA_PROCESSING: WHOLE GCMSsolution

PK$SPLASH: splash10-002b-0981000000-9f3495d57e5e09081d0f
PK$NUM_PEAK: 384
PK$PEAK: m/z int. rel.int.
  86.000000 785.000000 2
  87.000000 1722.000000 5
  88.000000 646.000000 2
  89.050000 1829.000000 5
  90.100000 201.000000 1
  91.050000 31962.000000 93
  92.050000 2683.000000 8
  93.050000 1446.000000 4
  94.100000 414.000000 1
  95.050000 13432.000000 39
  96.050000 2277.000000 7
  97.100000 15156.000000 44
  98.100000 1482.000000 4
  99.050000 4470.000000 13
  100.100000 967.000000 3
  101.050000 2390.000000 7
  102.000000 914.000000 3
  103.050000 3576.000000 10
  104.000000 670.000000 2
  105.050000 1249.000000 4
  106.000000 270.000000 1
  107.000000 90.000000 1
  108.000000 172.000000 1
  109.000000 204.000000 1
  110.000000 137.000000 1
  111.050000 972.000000 3
  112.150000 778.000000 2
  113.100000 39602.000000 116
  114.150000 3206.000000 9
  115.100000 48409.000000 142
  116.100000 6404.000000 19
  117.050000 40389.000000 118
  118.100000 4180.000000 12
  119.050000 4563.000000 13
  120.000000 295.000000 1
  121.000000 406.000000 1
  122.100000 881.000000 3
  123.050000 7195.000000 21
  124.100000 510.000000 1
  125.100000 1044.000000 3
  126.100000 330.000000 1
  127.100000 2754.000000 8
  128.100000 566.000000 2
  129.100000 27020.000000 79
  130.150000 3843.000000 11
  131.050000 21740.000000 64
  132.100000 3738.000000 11
  133.050000 38511.000000 113
  134.050000 5035.000000 15
  135.050000 4163.000000 12
  136.100000 310.000000 1
  137.100000 238.000000 1
  138.100000 36.000000 1
  139.100000 263.000000 1
  140.100000 351.000000 1
  141.150000 14166.000000 41
  142.150000 2995.000000 9
  143.100000 38026.000000 111
  144.150000 5304.000000 16
  145.100000 3826.000000 11
  146.150000 2020.000000 6
  147.100000 325628.000000 952
  148.100000 50087.000000 146
  149.100000 53684.000000 157
  150.100000 6130.000000 18
  151.050000 3206.000000 9
  152.100000 273.000000 1
  153.100000 706.000000 2
  154.100000 57.000000 1
  155.100000 798.000000 2
  156.100000 674.000000 2
  157.100000 80722.000000 236
  158.100000 12266.000000 36
  159.100000 4967.000000 15
  160.100000 668.000000 2
  161.100000 1599.000000 5
  162.150000 828.000000 2
  163.100000 14983.000000 44
  164.100000 2670.000000 8
  165.100000 1358.000000 4
  166.100000 318.000000 1
  167.100000 284.000000 1
  168.100000 270.000000 1
  169.100000 13078.000000 38
  170.050000 2002.000000 6
  171.050000 5418.000000 16
  172.000000 684.000000 2
  173.000000 1703.000000 5
  174.000000 324.000000 1
  175.100000 2031.000000 6
  176.100000 529.000000 2
  177.100000 945.000000 3
  178.100000 169.000000 1
  179.100000 132.000000 1
  180.100000 47.000000 1
  181.100000 126.000000 1
  182.100000 143.000000 1
  183.100000 578.000000 2
  184.150000 1162.000000 3
  185.050000 43215.000000 126
  186.050000 6513.000000 19
  187.000000 3335.000000 10
  188.000000 530.000000 2
  189.050000 8009.000000 23
  190.000000 3700.000000 11
  191.050000 7353.000000 22
  192.000000 1266.000000 4
  193.000000 951.000000 3
  194.000000 102.000000 1
  195.000000 186.000000 1
  196.000000 337.000000 1
  196.950000 2928.000000 9
  198.000000 495.000000 1
  199.000000 361.000000 1
  200.000000 65.000000 1
  201.000000 818.000000 2
  202.000000 134.000000 1
  203.000000 2647.000000 8
  204.050000 3607.000000 11
  205.050000 2843.000000 8
  206.000000 985.000000 3
  207.000000 3130.000000 9
  208.000000 606.000000 2
  209.000000 364.000000 1
  210.000000 33.000000 1
  211.000000 202.000000 1
  212.100000 3209.000000 9
  213.050000 40773.000000 119
  214.050000 6658.000000 19
  215.050000 3976.000000 12
  216.150000 1565.000000 5
  217.050000 33044.000000 97
  218.050000 7077.000000 21
  219.050000 4624.000000 14
  220.050000 814.000000 2
  221.050000 17968.000000 53
  222.000000 4114.000000 12
  223.000000 2444.000000 7
  224.000000 348.000000 1
  225.000000 148.000000 1
  226.000000 114.000000 1
  227.000000 346.000000 1
  228.000000 65.000000 1
  229.000000 506.000000 1
  230.100000 580.000000 2
  231.100000 65633.000000 192
  232.100000 14583.000000 43
  233.100000 8335.000000 24
  234.100000 1428.000000 4
  235.100000 438.000000 1
  236.100000 134.000000 1
  237.100000 551.000000 2
  238.100000 118.000000 1
  239.100000 126.000000 1
  240.100000 82.000000 1
  241.100000 110.000000 1
  242.100000 174.000000 1
  243.050000 7484.000000 22
  244.050000 1723.000000 5
  245.050000 5580.000000 16
  246.050000 1450.000000 4
  247.000000 646.000000 2
  248.000000 145.000000 1
  249.000000 108.000000 1
  250.000000 54.000000 1
  251.000000 44.000000 1
  253.000000 534.000000 2
  255.000000 94.000000 1
  256.000000 30.000000 1
  257.000000 343.000000 1
  258.150000 1330.000000 4
  259.100000 97962.000000 286
  260.050000 22616.000000 66
  261.100000 42903.000000 125
  262.100000 9266.000000 27
  263.100000 3553.000000 10
  264.100000 582.000000 2
  265.100000 353.000000 1
  267.100000 150.000000 1
  268.100000 38.000000 1
  269.100000 140.000000 1
  270.100000 13.000000 1
  271.100000 729.000000 2
  272.100000 230.000000 1
  273.100000 377.000000 1
  274.150000 2626.000000 8
  275.100000 341593.000000 999
  276.100000 84892.000000 248
  277.100000 32471.000000 95
  278.050000 5723.000000 17
  279.100000 1146.000000 3
  280.100000 167.000000 1
  281.100000 135.000000 1
  282.100000 39.000000 1
  283.100000 19.000000 1
  285.100000 255.000000 1
  286.100000 490.000000 1
  287.100000 56823.000000 166
  288.050000 12834.000000 38
  289.050000 5932.000000 17
  290.000000 1300.000000 4
  291.000000 975.000000 3
  292.000000 238.000000 1
  293.000000 140.000000 1
  294.000000 26.000000 1
  295.000000 210.000000 1
  296.000000 60.000000 1
  297.000000 58.000000 1
  298.000000 3.000000 1
  299.000000 134.000000 1
  300.000000 81.000000 1
  301.000000 556.000000 2
  302.000000 113.000000 1
  303.000000 177.000000 1
  304.100000 191.000000 1
  305.100000 14386.000000 42
  306.050000 4745.000000 14
  307.050000 4487.000000 13
  308.150000 1281.000000 4
  309.100000 476.000000 1
  310.100000 191.000000 1
  311.100000 66.000000 1
  313.100000 58.000000 1
  314.100000 84.000000 1
  315.100000 58.000000 1
  316.100000 38.000000 1
  317.100000 132.000000 1
  318.100000 33.000000 1
  319.100000 314.000000 1
  320.100000 118.000000 1
  321.100000 190.000000 1
  322.100000 95.000000 1
  323.100000 82.000000 1
  324.100000 121.000000 1
  325.100000 82.000000 1
  327.100000 228.000000 1
  328.100000 31.000000 1
  329.100000 145.000000 1
  330.100000 142.000000 1
  331.100000 166.000000 1
  332.100000 24.000000 1
  333.100000 4510.000000 13
  334.050000 1969.000000 6
  335.050000 1143.000000 3
  336.100000 252.000000 1
  337.100000 105.000000 1
  338.100000 42.000000 1
  339.100000 24.000000 1
  340.100000 98.000000 1
  341.100000 54.000000 1
  342.100000 16.000000 1
  343.100000 130.000000 1
  344.100000 158.000000 1
  345.100000 106.000000 1
  346.100000 154.000000 1
  347.100000 191.000000 1
  348.100000 673.000000 2
  349.050000 63036.000000 184
  350.100000 20897.000000 61
  351.100000 9953.000000 29
  352.050000 2474.000000 7
  353.100000 513.000000 2
  354.100000 154.000000 1
  355.100000 63.000000 1
  356.100000 49.000000 1
  357.100000 21.000000 1
  359.100000 140.000000 1
  360.100000 114.000000 1
  361.100000 420.000000 1
  362.100000 92.000000 1
  363.100000 150.000000 1
  364.100000 66.000000 1
  365.100000 54.000000 1
  366.100000 84.000000 1
  367.100000 36.000000 1
  368.100000 70.000000 1
  369.100000 11.000000 1
  370.100000 73.000000 1
  371.100000 73.000000 1
  373.100000 60.000000 1
  374.100000 21.000000 1
  375.100000 140.000000 1
  376.100000 362.000000 1
  377.100000 40116.000000 117
  378.100000 13390.000000 39
  379.100000 7070.000000 21
  380.150000 1451.000000 4
  381.100000 550.000000 2
  382.100000 100.000000 1
  383.100000 30.000000 1
  384.100000 8.000000 1
  385.100000 47.000000 1
  386.100000 30.000000 1
  388.100000 183.000000 1
  389.100000 50.000000 1
  390.100000 2.000000 1
  391.100000 11.000000 1
  392.100000 36.000000 1
  393.100000 110.000000 1
  394.100000 135.000000 1
  395.100000 16.000000 1
  396.100000 21.000000 1
  397.100000 111.000000 1
  398.100000 57.000000 1
  399.100000 33.000000 1
  400.100000 89.000000 1
  401.100000 30.000000 1
  404.100000 19.000000 1
  405.100000 57.000000 1
  407.100000 10.000000 1
  408.100000 13.000000 1
  409.100000 36.000000 1
  410.100000 2.000000 1
  411.100000 41.000000 1
  412.100000 19.000000 1
  413.100000 60.000000 1
  414.100000 90.000000 1
  415.100000 78.000000 1
  416.100000 87.000000 1
  417.100000 27.000000 1
  420.100000 65.000000 1
  423.100000 2.000000 1
  424.100000 84.000000 1
  425.100000 10.000000 1
  426.100000 42.000000 1
  430.100000 81.000000 1
  431.100000 27.000000 1
  432.100000 68.000000 1
  433.100000 19.000000 1
  434.100000 50.000000 1
  435.100000 38.000000 1
  436.100000 118.000000 1
  437.100000 13.000000 1
  438.100000 78.000000 1
  439.100000 50.000000 1
  440.100000 55.000000 1
  441.100000 76.000000 1
  442.100000 58.000000 1
  443.100000 55.000000 1
  444.100000 44.000000 1
  445.100000 84.000000 1
  446.100000 27.000000 1
  448.100000 24.000000 1
  449.100000 76.000000 1
  450.100000 62.000000 1
  451.100000 14.000000 1
  456.100000 90.000000 1
  457.100000 54.000000 1
  458.100000 148.000000 1
  459.100000 78.000000 1
  460.100000 31.000000 1
  461.100000 49.000000 1
  462.100000 58.000000 1
  463.100000 57.000000 1
  464.100000 94.000000 1
  465.100000 161.000000 1
  466.100000 97.000000 1
  467.100000 62.000000 1
  468.100000 41.000000 1
  469.100000 66.000000 1
  470.100000 24.000000 1
  472.100000 29.000000 1
  473.100000 52.000000 1
  474.100000 49.000000 1
  475.100000 24.000000 1
  476.100000 5.000000 1
  477.100000 41.000000 1
  478.100000 52.000000 1
  480.100000 10.000000 1
  482.100000 50.000000 1
  483.100000 39.000000 1
  484.100000 92.000000 1
  485.100000 14.000000 1
  486.100000 2.000000 1
  487.100000 52.000000 1
  488.100000 57.000000 1
  489.100000 92.000000 1
  492.100000 36.000000 1
  494.100000 42.000000 1
  495.100000 16.000000 1
  496.100000 57.000000 1
  497.100000 24.000000 1
  498.100000 122.000000 1
  499.100000 42.000000 1