ACCESSION: MSBNK-GL_Sciences_Inc-GLS00086
RECORD_TITLE: D-(+)-Fucose; EI-B; MS; n TMS; RT: 716.61 s
DATE: 2016.01.19 (Created 2012.08.03, modified 2013.07.31)
AUTHORS: Miyagawa H, Akimoto S, Yamasaki K, GL Sciences Inc.
LICENSE: CC BY-SA
COPYRIGHT: GL Sciences Inc.
COMMENT: The chemical compound was chemically modified with N-methyl-N-trimethylsilyl-trifluoroacetamide(MSTFA) before GC-MS analysis. When it has two or more functional groups, this modification gave a mixture of the TMS derivatives having different number of TMS groups at different functional groups.

CH$NAME: D-(+)-Fucose
CH$COMPOUND_CLASS: Natural Product
CH$FORMULA: C6H12O5
CH$EXACT_MASS: 164.06847
CH$SMILES: CC(O1)C(O)C(O)C(O)C(O)1
CH$IUPAC: InChI=1S/C6H12O5/c1-2-3(7)4(8)5(9)6(10)11-2/h2-10H,1H3/t2-,3+,4+,5-,6-/m1/s1
CH$LINK: CAS 2438-80-4
CH$LINK: INCHIKEY SHZGCJCMOBCMKK-FPRJBGLDSA-N

AC$INSTRUMENT: GCMS-2010 Plus, Shimadzu
AC$INSTRUMENT_TYPE: EI-B
AC$MASS_SPECTROMETRY: MS_TYPE MS
AC$MASS_SPECTROMETRY: ION_MODE POSITIVE
AC$MASS_SPECTROMETRY: GAS_PRESSURE 75 kPa
AC$MASS_SPECTROMETRY: ION_SOURCE_TEMPERATURE 200 C
AC$MASS_SPECTROMETRY: SCAN_RANGE_M/Z 85-500
AC$CHROMATOGRAPHY: COLUMN_NAME InertCap 5MS/NP 0.25 mmI.D. x 30 m, df=0.25 um
AC$CHROMATOGRAPHY: INJECTION_TEMPERATURE 230 C
AC$CHROMATOGRAPHY: OVEN_TEMPERATURE 80 C(2 min)-15 C/min - 330C
AC$CHROMATOGRAPHY: RETENTION_INDEX 1770
AC$CHROMATOGRAPHY: RETENTION_TIME 715.61
AC$CHROMATOGRAPHY: TRANSFARLINE_TEMPERATURE 250 C

MS$FOCUSED_ION: DERIVATIVE_TYPE n TMS
MS$DATA_PROCESSING: WHOLE GCMSsolution

PK$SPLASH: splash10-014i-0920000000-7c01738b0df3e68efc9d
PK$NUM_PEAK: 386
PK$PEAK: m/z int. rel.int.
  86.050000 913.000000 1
  87.000000 2486.000000 3
  88.050000 753.000000 1
  89.000000 23071.000000 29
  90.050000 1802.000000 2
  90.950000 1214.000000 2
  91.900000 201.000000 1
  92.900000 130.000000 1
  93.900000 46.000000 1
  94.900000 158.000000 1
  95.900000 396.000000 1
  96.900000 535.000000 1
  97.900000 455.000000 1
  99.100000 2177.000000 3
  100.050000 30017.000000 38
  101.050000 12057.000000 15
  102.050000 8978.000000 11
  103.050000 47901.000000 60
  104.050000 4633.000000 6
  105.100000 8974.000000 11
  106.100000 940.000000 1
  107.100000 566.000000 1
  108.100000 828.000000 1
  109.100000 137.000000 1
  110.100000 65.000000 1
  111.100000 1038.000000 1
  112.100000 775.000000 1
  113.100000 1753.000000 2
  114.050000 2259.000000 3
  115.050000 8173.000000 10
  116.150000 7925.000000 10
  117.050000 791357.000000 999
  118.100000 81855.000000 103
  119.050000 32058.000000 40
  120.100000 1974.000000 2
  121.100000 377.000000 1
  122.100000 289.000000 1
  123.100000 113.000000 1
  124.100000 116.000000 1
  125.100000 385.000000 1
  126.050000 1008.000000 1
  127.100000 1766.000000 2
  128.150000 1331.000000 2
  129.100000 56783.000000 72
  130.050000 17052.000000 22
  131.050000 35150.000000 44
  132.050000 4334.000000 5
  133.050000 32391.000000 41
  134.050000 3635.000000 5
  135.050000 2132.000000 3
  136.000000 223.000000 1
  137.000000 239.000000 1
  139.000000 169.000000 1
  140.000000 689.000000 1
  141.100000 1642.000000 2
  142.050000 2230.000000 3
  143.100000 13729.000000 17
  144.100000 2033.000000 3
  145.050000 2434.000000 3
  146.150000 1343.000000 2
  147.050000 85318.000000 108
  148.100000 12967.000000 16
  149.050000 10060.000000 13
  150.000000 926.000000 1
  151.000000 724.000000 1
  152.000000 351.000000 1
  153.000000 407.000000 1
  154.000000 438.000000 1
  155.100000 1209.000000 2
  156.050000 1072.000000 1
  157.050000 1263.000000 2
  158.050000 1520.000000 2
  159.150000 1900.000000 2
  160.100000 69911.000000 88
  161.050000 46021.000000 58
  162.100000 8001.000000 10
  163.100000 8521.000000 11
  164.100000 1287.000000 2
  165.100000 623.000000 1
  166.100000 143.000000 1
  167.100000 140.000000 1
  168.100000 154.000000 1
  169.100000 303.000000 1
  170.000000 487.000000 1
  171.050000 4835.000000 6
  172.050000 5070.000000 6
  173.050000 2509.000000 3
  174.100000 1495.000000 2
  175.100000 1161.000000 1
  176.100000 218.000000 1
  177.100000 4396.000000 6
  178.100000 823.000000 1
  179.100000 284.000000 1
  180.100000 786.000000 1
  181.100000 300.000000 1
  182.100000 942.000000 1
  183.100000 164.000000 1
  184.100000 71.000000 1
  185.100000 518.000000 1
  186.050000 1353.000000 2
  187.100000 654.000000 1
  188.050000 1563.000000 2
  189.050000 9873.000000 12
  190.050000 2719.000000 3
  191.000000 17270.000000 22
  192.000000 3018.000000 4
  193.050000 1351.000000 2
  194.000000 172.000000 1
  195.000000 63.000000 1
  196.000000 188.000000 1
  197.000000 242.000000 1
  198.000000 137.000000 1
  199.000000 146.000000 1
  200.050000 846.000000 1
  201.000000 21615.000000 27
  202.000000 4978.000000 6
  203.000000 14244.000000 18
  204.000000 13502.000000 17
  205.000000 7922.000000 10
  206.000000 2481.000000 3
  207.000000 1564.000000 2
  208.000000 314.000000 1
  209.000000 36.000000 1
  210.000000 169.000000 1
  211.000000 14.000000 1
  212.000000 514.000000 1
  213.000000 119.000000 1
  214.050000 3699.000000 5
  215.000000 1446.000000 2
  216.050000 1241.000000 2
  217.050000 14111.000000 18
  218.100000 4287.000000 5
  219.050000 40231.000000 51
  220.050000 8479.000000 11
  221.050000 5829.000000 7
  222.050000 1265.000000 2
  223.000000 298.000000 1
  224.000000 74.000000 1
  225.000000 78.000000 1
  226.000000 169.000000 1
  227.000000 140.000000 1
  228.000000 830.000000 1
  229.000000 348.000000 1
  230.050000 1777.000000 2
  231.050000 14787.000000 19
  232.050000 5275.000000 7
  233.050000 31314.000000 40
  234.100000 7100.000000 9
  235.000000 5513.000000 7
  236.000000 1247.000000 2
  237.000000 490.000000 1
  238.000000 118.000000 1
  239.000000 124.000000 1
  240.000000 108.000000 1
  241.000000 6.000000 1
  242.000000 463.000000 1
  243.000000 1196.000000 2
  244.050000 4206.000000 5
  245.050000 2630.000000 3
  246.050000 3160.000000 4
  247.000000 940.000000 1
  248.000000 390.000000 1
  249.000000 90.000000 1
  250.000000 114.000000 1
  251.000000 247.000000 1
  252.000000 18.000000 1
  253.000000 76.000000 1
  254.050000 1376.000000 2
  255.000000 250.000000 1
  256.000000 383.000000 1
  257.000000 265.000000 1
  258.000000 30.000000 1
  259.000000 199.000000 1
  260.000000 242.000000 1
  261.000000 447.000000 1
  262.050000 1679.000000 2
  263.100000 534.000000 1
  264.100000 238.000000 1
  265.100000 201.000000 1
  266.100000 100.000000 1
  267.100000 63.000000 1
  268.100000 49.000000 1
  269.100000 124.000000 1
  270.100000 2793.000000 4
  271.100000 458.000000 1
  272.100000 263.000000 1
  273.100000 10.000000 1
  274.050000 1882.000000 2
  275.000000 926.000000 1
  276.150000 1504.000000 2
  277.100000 98228.000000 124
  278.100000 25068.000000 32
  279.100000 11966.000000 15
  280.100000 2727.000000 3
  281.100000 574.000000 1
  282.100000 50.000000 1
  284.100000 103.000000 1
  285.100000 87.000000 1
  286.100000 548.000000 1
  287.100000 226.000000 1
  288.100000 556.000000 1
  289.100000 130.000000 1
  290.000000 212.000000 1
  291.000000 3575.000000 5
  292.150000 1217.000000 2
  293.100000 2849.000000 4
  294.100000 873.000000 1
  295.100000 470.000000 1
  296.100000 97.000000 1
  298.100000 3.000000 1
  299.100000 31.000000 1
  300.100000 84.000000 1
  302.100000 663.000000 1
  303.100000 287.000000 1
  304.100000 735.000000 1
  305.100000 2239.000000 3
  306.100000 1194.000000 2
  307.100000 330.000000 1
  308.100000 29.000000 1
  309.100000 122.000000 1
  310.100000 52.000000 1
  311.100000 54.000000 1
  312.100000 50.000000 1
  313.100000 3.000000 1
  314.100000 60.000000 1
  315.100000 193.000000 1
  316.100000 201.000000 1
  317.100000 380.000000 1
  318.100000 468.000000 1
  319.100000 322.000000 1
  320.150000 1062.000000 1
  321.150000 32675.000000 41
  322.100000 10108.000000 13
  323.100000 3946.000000 5
  324.100000 1046.000000 1
  325.100000 335.000000 1
  326.100000 105.000000 1
  327.100000 188.000000 1
  328.100000 78.000000 1
  329.100000 86.000000 1
  330.100000 193.000000 1
  331.100000 204.000000 1
  332.100000 346.000000 1
  333.100000 502.000000 1
  334.100000 254.000000 1
  335.100000 118.000000 1
  337.100000 1098.000000 1
  338.100000 388.000000 1
  339.100000 255.000000 1
  340.100000 18.000000 1
  341.100000 105.000000 1
  342.100000 16.000000 1
  343.100000 33.000000 1
  344.150000 1116.000000 1
  345.100000 442.000000 1
  346.100000 228.000000 1
  347.100000 60.000000 1
  348.100000 19.000000 1
  349.100000 351.000000 1
  350.100000 404.000000 1
  351.100000 95.000000 1
  352.100000 27.000000 1
  353.100000 18.000000 1
  355.100000 49.000000 1
  356.100000 16.000000 1
  358.100000 36.000000 1
  359.100000 38.000000 1
  360.100000 202.000000 1
  361.100000 103.000000 1
  362.100000 86.000000 1
  363.100000 270.000000 1
  364.100000 478.000000 1
  365.100000 278.000000 1
  366.100000 90.000000 1
  367.100000 47.000000 1
  368.100000 87.000000 1
  371.100000 90.000000 1
  372.100000 33.000000 1
  373.100000 3.000000 1
  374.100000 46.000000 1
  375.100000 54.000000 1
  376.100000 313.000000 1
  377.100000 60.000000 1
  378.100000 169.000000 1
  379.100000 30.000000 1
  380.100000 3.000000 1
  383.100000 100.000000 1
  384.100000 16.000000 1
  385.100000 24.000000 1
  386.100000 60.000000 1
  388.100000 13.000000 1
  389.100000 8.000000 1
  390.100000 55.000000 1
  391.100000 102.000000 1
  392.150000 1469.000000 2
  393.200000 532.000000 1
  394.200000 415.000000 1
  395.200000 180.000000 1
  396.200000 95.000000 1
  397.200000 55.000000 1
  398.200000 81.000000 1
  399.200000 36.000000 1
  400.200000 34.000000 1
  403.200000 62.000000 1
  404.200000 84.000000 1
  405.200000 76.000000 1
  406.200000 138.000000 1
  407.200000 66.000000 1
  408.200000 70.000000 1
  409.200000 113.000000 1
  410.200000 34.000000 1
  411.200000 98.000000 1
  413.200000 16.000000 1
  414.200000 76.000000 1
  415.200000 44.000000 1
  416.200000 62.000000 1
  417.200000 46.000000 1
  418.200000 63.000000 1
  420.200000 119.000000 1
  421.200000 47.000000 1
  422.200000 21.000000 1
  423.200000 5.000000 1
  424.200000 60.000000 1
  425.200000 92.000000 1
  426.200000 39.000000 1
  428.200000 27.000000 1
  429.200000 58.000000 1
  430.200000 24.000000 1
  431.200000 33.000000 1
  432.200000 82.000000 1
  433.200000 21.000000 1
  434.200000 98.000000 1
  435.200000 396.000000 1
  436.200000 204.000000 1
  437.200000 63.000000 1
  439.200000 84.000000 1
  440.200000 31.000000 1
  442.200000 66.000000 1
  444.200000 27.000000 1
  445.200000 41.000000 1
  446.200000 102.000000 1
  447.200000 33.000000 1
  448.200000 30.000000 1
  449.200000 62.000000 1
  450.200000 295.000000 1
  451.200000 76.000000 1
  452.200000 18.000000 1
  454.200000 29.000000 1
  455.200000 65.000000 1
  458.200000 2.000000 1
  459.200000 73.000000 1
  460.200000 33.000000 1
  461.200000 18.000000 1
  462.200000 102.000000 1
  463.200000 74.000000 1
  464.200000 71.000000 1
  465.200000 76.000000 1
  466.200000 54.000000 1
  467.200000 62.000000 1
  468.200000 47.000000 1
  469.200000 26.000000 1
  470.200000 143.000000 1
  472.200000 89.000000 1
  473.200000 14.000000 1
  474.200000 11.000000 1
  475.200000 19.000000 1
  477.200000 47.000000 1
  478.200000 145.000000 1
  479.200000 142.000000 1
  480.200000 113.000000 1
  481.200000 217.000000 1
  482.200000 143.000000 1
  483.200000 154.000000 1
  484.200000 178.000000 1
  485.200000 58.000000 1
  486.200000 98.000000 1
  487.200000 54.000000 1
  488.200000 79.000000 1
  489.200000 16.000000 1
  490.200000 16.000000 1
  491.200000 31.000000 1
  492.200000 70.000000 1
  493.200000 63.000000 1
  494.200000 82.000000 1
  497.200000 90.000000 1
  498.200000 63.000000 1