ACCESSION: MSBNK-GL_Sciences_Inc-GLS00087
RECORD_TITLE: (-)-Shikimic acid; EI-B; MS; n TMS; RT: 738.71 s
DATE: 2016.01.19 (Created 2012.08.03, modified 2013.07.31)
AUTHORS: Miyagawa H, Akimoto S, Yamasaki K, GL Sciences Inc.
LICENSE: CC BY-SA
COPYRIGHT: GL Sciences Inc.
COMMENT: The chemical compound was chemically modified with N-methyl-N-trimethylsilyl-trifluoroacetamide(MSTFA) before GC-MS analysis. When it has two or more functional groups, this modification gave a mixture of the TMS derivatives having different number of TMS groups at different functional groups.

CH$NAME: (-)-Shikimic acid
CH$COMPOUND_CLASS: Natural Product
CH$FORMULA: C7H10O5
CH$EXACT_MASS: 174.05282
CH$SMILES: OC(=O)C(C1)=C[C@@H](O)[C@@H](O)[C@H](O)1
CH$IUPAC: InChI=1S/C7H10O5/c8-4-1-3(7(11)12)2-5(9)6(4)10/h1,4-6,8-10H,2H2,(H,11,12)/t4-,5-,6-/m1/s1
CH$LINK: CAS 138-59-0
CH$LINK: CHEBI 16119
CH$LINK: KEGG C00493
CH$LINK: PUBCHEM 3776
CH$LINK: INCHIKEY JXOHGGNKMLTUBP-HSUXUTPPSA-N
CH$LINK: COMPTOX DTXSID4032039

AC$INSTRUMENT: GCMS-2010 Plus, Shimadzu
AC$INSTRUMENT_TYPE: EI-B
AC$MASS_SPECTROMETRY: MS_TYPE MS
AC$MASS_SPECTROMETRY: ION_MODE POSITIVE
AC$MASS_SPECTROMETRY: GAS_PRESSURE 75 kPa
AC$MASS_SPECTROMETRY: ION_SOURCE_TEMPERATURE 200 C
AC$MASS_SPECTROMETRY: SCAN_RANGE_M/Z 85-500
AC$CHROMATOGRAPHY: COLUMN_NAME InertCap 5MS/NP 0.25 mmI.D. x 30 m, df=0.25 um
AC$CHROMATOGRAPHY: INJECTION_TEMPERATURE 230 C
AC$CHROMATOGRAPHY: OVEN_TEMPERATURE 80 C(2 min)-15 C/min - 330C
AC$CHROMATOGRAPHY: RETENTION_INDEX 1820
AC$CHROMATOGRAPHY: RETENTION_TIME 738.71
AC$CHROMATOGRAPHY: TRANSFARLINE_TEMPERATURE 250 C

MS$FOCUSED_ION: DERIVATIVE_TYPE n TMS
MS$DATA_PROCESSING: WHOLE GCMSsolution

PK$SPLASH: splash10-0udi-0391000000-ddb2c574233062a911fa
PK$NUM_PEAK: 395
PK$PEAK: m/z int. rel.int.
  86.000000 658.000000 1
  87.050000 2604.000000 1
  88.050000 1202.000000 1
  89.050000 2221.000000 1
  90.100000 620.000000 1
  91.050000 12201.000000 5
  92.050000 3356.000000 1
  93.050000 17689.000000 8
  94.050000 3745.000000 2
  95.000000 5167.000000 2
  96.050000 3430.000000 1
  97.000000 2844.000000 1
  98.050000 1099.000000 1
  99.000000 3255.000000 1
  100.000000 1226.000000 1
  101.000000 7473.000000 3
  102.000000 1934.000000 1
  103.050000 31369.000000 13
  104.050000 3494.000000 1
  105.050000 11556.000000 5
  106.050000 2164.000000 1
  107.000000 2247.000000 1
  108.050000 897.000000 1
  109.000000 5218.000000 2
  110.000000 748.000000 1
  111.000000 5599.000000 2
  112.000000 1122.000000 1
  113.000000 2804.000000 1
  114.000000 431.000000 1
  115.000000 4015.000000 2
  116.000000 7847.000000 3
  117.000000 9500.000000 4
  118.000000 2076.000000 1
  119.050000 10617.000000 5
  120.050000 1787.000000 1
  121.000000 9489.000000 4
  122.050000 1382.000000 1
  123.050000 5475.000000 2
  124.000000 1289.000000 1
  125.000000 5759.000000 2
  126.100000 1964.000000 1
  127.050000 1894.000000 1
  128.100000 414.000000 1
  129.050000 8476.000000 4
  130.050000 1905.000000 1
  131.000000 30290.000000 13
  132.050000 4872.000000 2
  133.050000 85777.000000 37
  134.050000 12723.000000 5
  135.050000 11459.000000 5
  136.050000 1773.000000 1
  137.050000 2926.000000 1
  138.050000 858.000000 1
  139.050000 5464.000000 2
  140.150000 1757.000000 1
  141.050000 21367.000000 9
  142.050000 3929.000000 2
  143.050000 4344.000000 2
  144.000000 716.000000 1
  145.000000 1761.000000 1
  146.150000 3949.000000 2
  147.050000 422912.000000 181
  148.050000 64023.000000 27
  149.050000 45472.000000 19
  150.100000 5217.000000 2
  151.050000 20475.000000 9
  152.050000 4390.000000 2
  153.100000 4470.000000 2
  154.100000 2393.000000 1
  155.100000 3033.000000 1
  156.050000 2832.000000 1
  157.000000 3404.000000 1
  158.000000 834.000000 1
  159.100000 2750.000000 1
  160.100000 529.000000 1
  161.050000 4087.000000 2
  162.100000 841.000000 1
  163.050000 4302.000000 2
  164.100000 2473.000000 1
  165.100000 9070.000000 4
  166.000000 5583.000000 2
  167.000000 21798.000000 9
  168.050000 4251.000000 2
  169.050000 10027.000000 4
  170.050000 1680.000000 1
  171.000000 1698.000000 1
  172.000000 428.000000 1
  173.000000 1002.000000 1
  174.000000 210.000000 1
  175.000000 1916.000000 1
  176.000000 431.000000 1
  177.000000 7247.000000 3
  178.050000 1337.000000 1
  179.050000 5098.000000 2
  180.050000 18627.000000 8
  181.000000 23359.000000 10
  182.000000 8087.000000 3
  183.000000 4959.000000 2
  184.000000 1586.000000 1
  184.950000 1043.000000 1
  185.900000 633.000000 1
  187.000000 2386.000000 1
  188.050000 1483.000000 1
  189.000000 128308.000000 55
  190.050000 23844.000000 10
  191.000000 62095.000000 27
  192.000000 10994.000000 5
  193.000000 44772.000000 19
  194.000000 7695.000000 3
  195.000000 13330.000000 6
  196.000000 2815.000000 1
  196.950000 2631.000000 1
  198.000000 510.000000 1
  199.000000 1089.000000 1
  200.000000 415.000000 1
  201.000000 655.000000 1
  202.000000 594.000000 1
  203.050000 11791.000000 5
  204.050000 2330259.000000 999
  205.000000 417174.000000 179
  206.000000 200934.000000 86
  207.000000 34102.000000 15
  208.050000 6747.000000 3
  208.950000 6687.000000 3
  210.000000 3606.000000 2
  211.000000 3604.000000 2
  212.000000 958.000000 1
  212.950000 1367.000000 1
  214.000000 577.000000 1
  215.000000 5182.000000 2
  216.050000 1675.000000 1
  217.000000 13390.000000 6
  218.050000 2747.000000 1
  219.000000 1975.000000 1
  220.000000 455.000000 1
  221.000000 33078.000000 14
  222.050000 7793.000000 3
  223.000000 15766.000000 7
  224.000000 3710.000000 2
  225.000000 6506.000000 3
  226.000000 1871.000000 1
  227.000000 2719.000000 1
  228.050000 1533.000000 1
  229.000000 4873.000000 2
  230.000000 1567.000000 1
  231.000000 1078.000000 1
  232.000000 356.000000 1
  233.000000 305.000000 1
  235.000000 358.000000 1
  236.000000 356.000000 1
  237.000000 2364.000000 1
  238.050000 1169.000000 1
  239.000000 38415.000000 16
  240.000000 9785.000000 4
  241.000000 10300.000000 4
  242.050000 2463.000000 1
  243.000000 22486.000000 10
  244.050000 4523.000000 2
  245.000000 2516.000000 1
  246.000000 537.000000 1
  247.000000 169.000000 1
  249.000000 313.000000 1
  250.000000 126.000000 1
  250.950000 2614.000000 1
  252.000000 758.000000 1
  253.050000 9089.000000 4
  254.050000 117671.000000 50
  255.050000 163097.000000 70
  256.050000 49284.000000 21
  257.050000 19722.000000 8
  258.050000 11633.000000 5
  259.000000 2599.000000 1
  260.100000 1020.000000 1
  261.100000 185.000000 1
  262.100000 129.000000 1
  263.100000 260.000000 1
  264.000000 236.000000 1
  265.050000 18470.000000 8
  266.050000 5365.000000 2
  267.050000 41801.000000 18
  268.050000 9971.000000 4
  269.050000 6739.000000 3
  269.950000 2155.000000 1
  271.050000 1762.000000 1
  272.100000 385.000000 1
  273.100000 178.000000 1
  274.100000 82.000000 1
  275.100000 124.000000 1
  276.100000 159.000000 1
  277.100000 89.000000 1
  278.100000 150.000000 1
  279.100000 260.000000 1
  280.100000 273.000000 1
  281.100000 10812.000000 5
  282.050000 101961.000000 44
  283.050000 54188.000000 23
  284.050000 17666.000000 8
  285.050000 5386.000000 2
  286.100000 1113.000000 1
  287.100000 284.000000 1
  288.100000 26.000000 1
  289.100000 98.000000 1
  290.100000 161.000000 1
  291.100000 735.000000 1
  292.100000 201.000000 1
  293.100000 140.000000 1
  294.100000 153.000000 1
  295.100000 161.000000 1
  296.100000 161.000000 1
  297.100000 911.000000 1
  298.100000 351.000000 1
  299.100000 1673.000000 1
  300.100000 601.000000 1
  301.100000 398.000000 1
  302.100000 71.000000 1
  303.100000 287.000000 1
  304.100000 313.000000 1
  305.100000 12980.000000 6
  306.000000 4401.000000 2
  307.050000 2406.000000 1
  308.000000 362.000000 1
  309.000000 279.000000 1
  310.000000 202.000000 1
  311.050000 2569.000000 1
  312.100000 13636.000000 6
  313.100000 8420.000000 4
  314.050000 3498.000000 1
  314.900000 1626.000000 1
  315.900000 548.000000 1
  316.900000 236.000000 1
  318.150000 1450.000000 1
  319.100000 527.000000 1
  320.100000 871.000000 1
  321.100000 110.000000 1
  322.100000 212.000000 1
  323.100000 130.000000 1
  324.000000 68.000000 1
  325.000000 1745.000000 1
  326.000000 505.000000 1
  327.050000 2210.000000 1
  328.100000 1238.000000 1
  329.050000 11538.000000 5
  330.150000 4534.000000 2
  331.100000 47434.000000 20
  332.050000 13782.000000 6
  333.050000 6934.000000 3
  334.100000 1612.000000 1
  335.100000 442.000000 1
  336.100000 2.000000 1
  338.100000 57.000000 1
  339.100000 81.000000 1
  340.100000 127.000000 1
  341.050000 4023.000000 2
  342.050000 10113.000000 4
  343.050000 10654.000000 5
  344.050000 5647.000000 2
  345.100000 3233.000000 1
  346.100000 6310.000000 3
  347.050000 2347.000000 1
  348.000000 910.000000 1
  349.000000 132.000000 1
  350.000000 81.000000 1
  351.000000 135.000000 1
  352.000000 50.000000 1
  353.000000 190.000000 1
  354.100000 274.000000 1
  355.050000 14301.000000 6
  356.050000 39582.000000 17
  357.050000 132118.000000 57
  358.000000 40009.000000 17
  359.050000 22722.000000 10
  360.000000 5903.000000 3
  361.050000 1728.000000 1
  362.000000 263.000000 1
  363.000000 94.000000 1
  364.000000 34.000000 1
  365.000000 38.000000 1
  366.000000 8.000000 1
  367.000000 140.000000 1
  368.000000 41.000000 1
  369.000000 114.000000 1
  370.100000 223.000000 1
  371.150000 5740.000000 2
  372.100000 156975.000000 67
  373.050000 47498.000000 20
  374.050000 26583.000000 11
  375.000000 6236.000000 3
  376.000000 1604.000000 1
  377.000000 273.000000 1
  378.000000 62.000000 1
  379.000000 11.000000 1
  380.000000 121.000000 1
  381.000000 63.000000 1
  382.000000 41.000000 1
  383.000000 50.000000 1
  384.000000 71.000000 1
  387.000000 44.000000 1
  388.000000 34.000000 1
  390.000000 166.000000 1
  392.000000 24.000000 1
  393.000000 41.000000 1
  394.000000 5.000000 1
  395.000000 76.000000 1
  399.000000 13.000000 1
  400.000000 68.000000 1
  401.000000 33.000000 1
  402.000000 63.000000 1
  403.000000 119.000000 1
  404.000000 113.000000 1
  405.000000 145.000000 1
  406.000000 5.000000 1
  407.000000 36.000000 1
  408.000000 78.000000 1
  409.000000 54.000000 1
  411.000000 55.000000 1
  413.000000 22.000000 1
  414.000000 73.000000 1
  415.000000 70.000000 1
  416.100000 55.000000 1
  417.100000 4164.000000 2
  418.050000 1670.000000 1
  419.100000 1116.000000 1
  420.100000 434.000000 1
  421.100000 188.000000 1
  422.100000 127.000000 1
  423.100000 58.000000 1
  425.100000 52.000000 1
  426.100000 73.000000 1
  427.100000 89.000000 1
  428.100000 41.000000 1
  429.100000 158.000000 1
  430.100000 47.000000 1
  431.100000 247.000000 1
  432.100000 126.000000 1
  433.100000 180.000000 1
  434.100000 65.000000 1
  435.100000 21.000000 1
  436.100000 50.000000 1
  438.100000 124.000000 1
  440.100000 143.000000 1
  441.100000 89.000000 1
  442.100000 82.000000 1
  443.100000 13.000000 1
  444.100000 26.000000 1
  445.100000 292.000000 1
  446.150000 1039.000000 1
  447.100000 31823.000000 14
  448.050000 12764.000000 5
  449.050000 7514.000000 3
  450.050000 1790.000000 1
  451.100000 540.000000 1
  452.100000 65.000000 1
  453.100000 76.000000 1
  454.100000 49.000000 1
  455.100000 46.000000 1
  456.100000 70.000000 1
  457.100000 26.000000 1
  458.100000 46.000000 1
  459.100000 24.000000 1
  460.100000 49.000000 1
  461.150000 1088.000000 1
  462.100000 56807.000000 24
  463.100000 25103.000000 11
  464.050000 14233.000000 6
  465.050000 4352.000000 2
  466.050000 1154.000000 1
  467.100000 199.000000 1
  468.100000 146.000000 1
  469.100000 70.000000 1
  471.100000 41.000000 1
  472.100000 55.000000 1
  473.100000 54.000000 1
  474.100000 65.000000 1
  475.100000 21.000000 1
  476.100000 49.000000 1
  477.100000 81.000000 1
  478.100000 19.000000 1
  479.100000 162.000000 1
  480.100000 10.000000 1
  481.100000 39.000000 1
  482.100000 71.000000 1
  483.100000 71.000000 1
  484.100000 161.000000 1
  485.100000 62.000000 1
  487.100000 90.000000 1
  488.100000 76.000000 1
  489.100000 105.000000 1
  491.100000 94.000000 1
  492.100000 29.000000 1
  493.100000 10.000000 1
  494.100000 49.000000 1
  495.100000 11.000000 1
  496.100000 19.000000 1
  498.100000 86.000000 1
  499.100000 158.000000 1