ACCESSION: MSBNK-GL_Sciences_Inc-GLS00133
RECORD_TITLE: Pimelic acid; EI-B; MS; 2 TMS; RT: 635.95 s
DATE: 2016.01.19 (Created 2012.08.03, modified 2013.07.31)
AUTHORS: Miyagawa H, Akimoto S, Yamasaki K, GL Sciences Inc.
LICENSE: CC BY-SA
COPYRIGHT: GLS
COMMENT: The chemical compound was chemically modified with N-methyl-N-trimethylsilyl-trifluoroacetamide(MSTFA) before GC-MS analysis. When it has two or more functional groups, this modification gave a mixture of the TMS derivatives having different number of TMS groups at different functional groups.

CH$NAME: Pimelic acid
CH$NAME: Heptanedioate
CH$COMPOUND_CLASS: Natural Product
CH$FORMULA: C7H12O4
CH$EXACT_MASS: 160.07356
CH$SMILES: OC(=O)CCCCCC(O)=O
CH$IUPAC: InChI=1S/C7H12O4/c8-6(9)4-2-1-3-5-7(10)11/h1-5H2,(H,8,9)(H,10,11)
CH$LINK: CAS 111-16-0
CH$LINK: CHEBI 30531
CH$LINK: KEGG C02656
CH$LINK: PUBCHEM 5629
CH$LINK: INCHIKEY WLJVNTCWHIRURA-UHFFFAOYSA-N
CH$LINK: COMPTOX DTXSID5021598

AC$INSTRUMENT: GCMS-2010 Plus, Shimadzu
AC$INSTRUMENT_TYPE: EI-B
AC$MASS_SPECTROMETRY: MS_TYPE MS
AC$MASS_SPECTROMETRY: ION_MODE POSITIVE
AC$MASS_SPECTROMETRY: GAS_PRESSURE 75 kPa
AC$MASS_SPECTROMETRY: ION_SOURCE_TEMPERATURE 200 C
AC$MASS_SPECTROMETRY: SCAN_RANGE_M/Z 85-500
AC$CHROMATOGRAPHY: COLUMN_NAME InertCap 5MS/NP 0.25 mmI.D. x 30 m, df=0.25 um
AC$CHROMATOGRAPHY: INJECTION_TEMPERATURE 230 C
AC$CHROMATOGRAPHY: OVEN_TEMPERATURE 80 C(2 min)-15 C/min - 330C
AC$CHROMATOGRAPHY: RETENTION_INDEX 1606
AC$CHROMATOGRAPHY: RETENTION_TIME 635.95
AC$CHROMATOGRAPHY: TRANSFARLINE_TEMPERATURE 250 C

MS$FOCUSED_ION: DERIVATIVE_TYPE 2 TMS
MS$DATA_PROCESSING: WHOLE GCMSsolution

PK$SPLASH: splash10-054k-1910000000-fc6cb63b081b4f5f7fd3
PK$NUM_PEAK: 372
PK$PEAK: m/z int. rel.int.
  86.050000 1682.000000 19
  87.000000 1020.000000 12
  88.050000 1480.000000 17
  89.050000 1773.000000 20
  90.000000 404.000000 5
  91.000000 449.000000 5
  92.000000 110.000000 1
  93.000000 217.000000 2
  94.000000 199.000000 2
  95.100000 3105.000000 35
  96.100000 4207.000000 47
  97.050000 28813.000000 325
  98.100000 2284.000000 26
  99.050000 3198.000000 36
  100.000000 564.000000 6
  101.050000 2762.000000 31
  102.000000 610.000000 7
  103.000000 1031.000000 12
  104.000000 194.000000 2
  105.000000 697.000000 8
  106.000000 202.000000 2
  107.000000 548.000000 6
  108.000000 97.000000 1
  109.000000 102.000000 1
  111.000000 385.000000 4
  112.000000 332.000000 4
  113.100000 1908.000000 22
  114.100000 311.000000 4
  115.000000 1268.000000 14
  116.050000 8158.000000 92
  117.050000 21975.000000 248
  118.050000 2595.000000 29
  119.050000 1701.000000 19
  120.100000 252.000000 3
  121.100000 114.000000 1
  122.100000 183.000000 2
  123.100000 534.000000 6
  124.050000 6277.000000 71
  125.050000 55522.000000 626
  126.100000 4362.000000 49
  127.100000 1020.000000 12
  128.000000 687.000000 8
  129.050000 16028.000000 181
  130.050000 2937.000000 33
  131.050000 3591.000000 41
  132.050000 2437.000000 27
  133.050000 7058.000000 80
  134.000000 788.000000 9
  135.000000 970.000000 11
  136.000000 276.000000 3
  137.050000 1622.000000 18
  138.000000 143.000000 2
  139.000000 102.000000 1
  140.000000 105.000000 1
  141.000000 217.000000 2
  142.100000 1434.000000 16
  143.050000 2390.000000 27
  144.100000 335.000000 4
  145.100000 1446.000000 16
  146.100000 446.000000 5
  147.050000 42004.000000 474
  148.050000 6683.000000 75
  149.000000 13802.000000 156
  150.100000 1710.000000 19
  151.100000 788.000000 9
  152.100000 100.000000 1
  153.100000 170.000000 2
  154.100000 292.000000 3
  155.100000 88558.000000 999
  156.050000 12476.000000 141
  157.100000 8078.000000 91
  158.050000 2501.000000 28
  159.100000 1122.000000 13
  160.100000 790.000000 9
  161.100000 241.000000 3
  162.100000 385.000000 4
  163.100000 258.000000 3
  164.100000 86.000000 1
  165.100000 118.000000 1
  166.100000 111.000000 1
  167.100000 63.000000 1
  168.100000 231.000000 3
  169.100000 2316.000000 26
  170.050000 2313.000000 26
  171.050000 6327.000000 71
  172.050000 4131.000000 47
  173.050000 26817.000000 303
  174.050000 3877.000000 44
  175.050000 1030.000000 12
  176.000000 271.000000 3
  177.000000 247.000000 3
  178.000000 39.000000 1
  179.000000 73.000000 1
  180.000000 98.000000 1
  181.000000 204.000000 2
  182.000000 102.000000 1
  183.000000 47.000000 1
  184.000000 49.000000 1
  185.050000 1151.000000 13
  186.050000 10002.000000 113
  187.050000 2190.000000 25
  188.100000 598.000000 7
  189.100000 842.000000 9
  190.100000 206.000000 2
  191.100000 777.000000 9
  192.100000 142.000000 2
  193.100000 106.000000 1
  194.100000 76.000000 1
  195.100000 103.000000 1
  196.100000 402.000000 5
  197.100000 426.000000 5
  198.000000 127.000000 1
  199.000000 14038.000000 158
  200.000000 1892.000000 21
  201.000000 796.000000 9
  202.000000 27.000000 1
  203.000000 826.000000 9
  204.000000 8756.000000 99
  205.000000 1529.000000 17
  206.000000 743.000000 8
  207.000000 329.000000 4
  208.000000 127.000000 1
  209.000000 21.000000 1
  210.000000 74.000000 1
  212.000000 95.000000 1
  213.000000 70.000000 1
  214.050000 3807.000000 43
  214.950000 1735.000000 20
  216.000000 326.000000 4
  217.050000 10519.000000 119
  218.050000 2502.000000 28
  219.000000 1162.000000 13
  220.000000 137.000000 2
  221.000000 178.000000 2
  222.000000 58.000000 1
  223.000000 55.000000 1
  224.000000 79.000000 1
  225.000000 44.000000 1
  226.000000 57.000000 1
  229.000000 807.000000 9
  230.000000 324.000000 4
  231.000000 449.000000 5
  232.000000 255.000000 3
  233.000000 54.000000 1
  234.000000 92.000000 1
  235.000000 65.000000 1
  236.000000 55.000000 1
  237.000000 76.000000 1
  238.000000 78.000000 1
  239.000000 34.000000 1
  240.000000 2.000000 1
  241.000000 2.000000 1
  243.000000 708.000000 8
  244.000000 308.000000 3
  245.050000 1950.000000 22
  246.000000 468.000000 5
  247.000000 287.000000 3
  248.000000 90.000000 1
  249.000000 63.000000 1
  250.000000 73.000000 1
  251.000000 34.000000 1
  253.000000 106.000000 1
  254.000000 55.000000 1
  255.000000 44.000000 1
  256.000000 52.000000 1
  257.000000 90.000000 1
  258.000000 63.000000 1
  259.000000 89.000000 1
  260.000000 66.000000 1
  261.000000 826.000000 9
  262.000000 959.000000 11
  263.000000 310.000000 3
  264.000000 78.000000 1
  265.000000 111.000000 1
  266.000000 3.000000 1
  267.000000 21.000000 1
  269.000000 86.000000 1
  270.000000 16.000000 1
  271.000000 247.000000 3
  272.000000 10.000000 1
  273.000000 110.000000 1
  274.000000 57.000000 1
  275.000000 134.000000 2
  276.000000 86.000000 1
  277.000000 3.000000 1
  278.000000 66.000000 1
  279.000000 55.000000 1
  280.000000 44.000000 1
  281.000000 111.000000 1
  282.000000 6.000000 1
  283.000000 22.000000 1
  284.000000 90.000000 1
  285.000000 6.000000 1
  286.000000 143.000000 2
  287.000000 118.000000 1
  288.000000 100.000000 1
  289.050000 16232.000000 183
  290.050000 3515.000000 40
  291.100000 1370.000000 15
  292.100000 289.000000 3
  293.100000 87.000000 1
  294.100000 16.000000 1
  295.100000 55.000000 1
  296.100000 76.000000 1
  297.100000 84.000000 1
  298.100000 114.000000 1
  299.100000 62.000000 1
  300.100000 10.000000 1
  301.100000 71.000000 1
  302.100000 68.000000 1
  303.100000 11.000000 1
  304.100000 142.000000 2
  305.100000 21.000000 1
  306.100000 14.000000 1
  307.100000 129.000000 1
  309.100000 6.000000 1
  310.100000 92.000000 1
  311.100000 5.000000 1
  313.100000 68.000000 1
  314.100000 73.000000 1
  315.100000 68.000000 1
  316.100000 111.000000 1
  317.100000 31.000000 1
  318.100000 66.000000 1
  319.100000 63.000000 1
  320.100000 82.000000 1
  321.100000 36.000000 1
  323.100000 50.000000 1
  324.100000 14.000000 1
  326.100000 65.000000 1
  327.100000 63.000000 1
  328.100000 27.000000 1
  329.100000 55.000000 1
  331.100000 52.000000 1
  333.100000 100.000000 1
  334.100000 44.000000 1
  335.100000 76.000000 1
  336.100000 13.000000 1
  337.100000 39.000000 1
  338.100000 89.000000 1
  339.100000 3.000000 1
  340.100000 94.000000 1
  341.100000 81.000000 1
  343.100000 95.000000 1
  344.100000 21.000000 1
  345.100000 113.000000 1
  346.100000 100.000000 1
  347.100000 55.000000 1
  348.100000 31.000000 1
  349.100000 79.000000 1
  350.100000 58.000000 1
  351.100000 24.000000 1
  352.100000 3.000000 1
  353.100000 13.000000 1
  355.100000 14.000000 1
  357.100000 71.000000 1
  358.100000 19.000000 1
  359.100000 36.000000 1
  360.100000 47.000000 1
  361.100000 76.000000 1
  362.100000 66.000000 1
  364.100000 8.000000 1
  365.100000 21.000000 1
  367.100000 3.000000 1
  368.100000 33.000000 1
  369.100000 36.000000 1
  370.100000 24.000000 1
  372.100000 65.000000 1
  373.100000 87.000000 1
  374.100000 18.000000 1
  376.100000 50.000000 1
  377.100000 103.000000 1
  378.100000 50.000000 1
  379.100000 118.000000 1
  380.100000 71.000000 1
  381.100000 34.000000 1
  383.100000 50.000000 1
  384.100000 65.000000 1
  386.100000 18.000000 1
  387.100000 27.000000 1
  388.100000 36.000000 1
  389.100000 97.000000 1
  391.100000 68.000000 1
  392.100000 84.000000 1
  393.100000 31.000000 1
  394.100000 47.000000 1
  395.100000 26.000000 1
  397.100000 54.000000 1
  399.100000 44.000000 1
  400.100000 44.000000 1
  402.100000 100.000000 1
  403.100000 24.000000 1
  404.100000 44.000000 1
  405.100000 79.000000 1
  406.100000 94.000000 1
  407.100000 62.000000 1
  408.100000 94.000000 1
  409.100000 57.000000 1
  410.100000 5.000000 1
  411.100000 50.000000 1
  412.100000 13.000000 1
  413.100000 89.000000 1
  415.100000 21.000000 1
  417.100000 60.000000 1
  418.100000 108.000000 1
  419.100000 70.000000 1
  420.100000 76.000000 1
  421.100000 18.000000 1
  422.100000 87.000000 1
  423.100000 31.000000 1
  424.100000 39.000000 1
  426.100000 10.000000 1
  427.100000 68.000000 1
  428.100000 3.000000 1
  429.100000 30.000000 1
  431.100000 24.000000 1
  432.100000 55.000000 1
  433.100000 16.000000 1
  434.100000 57.000000 1
  435.100000 42.000000 1
  436.100000 57.000000 1
  437.100000 71.000000 1
  438.100000 70.000000 1
  439.100000 60.000000 1
  441.100000 73.000000 1
  443.100000 166.000000 2
  444.100000 38.000000 1
  446.100000 129.000000 1
  447.100000 33.000000 1
  448.100000 13.000000 1
  449.100000 57.000000 1
  451.100000 74.000000 1
  453.100000 89.000000 1
  454.100000 95.000000 1
  455.100000 26.000000 1
  456.100000 19.000000 1
  457.100000 19.000000 1
  459.100000 175.000000 2
  460.100000 111.000000 1
  461.100000 24.000000 1
  463.100000 74.000000 1
  464.100000 39.000000 1
  465.100000 19.000000 1
  467.100000 116.000000 1
  468.100000 21.000000 1
  469.100000 74.000000 1
  470.100000 68.000000 1
  471.100000 90.000000 1
  472.100000 82.000000 1
  473.100000 44.000000 1
  474.100000 8.000000 1
  475.100000 21.000000 1
  476.100000 29.000000 1
  477.100000 76.000000 1
  478.100000 76.000000 1
  479.100000 89.000000 1
  480.100000 52.000000 1
  481.100000 13.000000 1
  483.100000 68.000000 1
  484.100000 108.000000 1
  485.100000 38.000000 1
  486.100000 58.000000 1
  487.100000 114.000000 1
  488.100000 13.000000 1
  489.100000 2.000000 1
  490.100000 105.000000 1
  492.100000 58.000000 1
  493.100000 27.000000 1
  494.100000 31.000000 1
  495.100000 78.000000 1
  496.100000 57.000000 1
  498.100000 16.000000 1