ACCESSION: MSBNK-Fac_Eng_Univ_Tokyo-JP000356
RECORD_TITLE: 1,2,3,4-TETRAHYDRO-CIS-2-PHENYL-1-NAPHTHOL; EI-B; MS
DATE: 2016.01.19 (Created 2008.10.21, modified 2011.05.06)
AUTHORS: SASAKI S, TOYOHASHI UNIV. OF TECH.
LICENSE: CC BY-NC-SA

CH$NAME: 1,2,3,4-TETRAHYDRO-CIS-2-PHENYL-1-NAPHTHOL
CH$COMPOUND_CLASS: N/A
CH$FORMULA: C16H16O
CH$EXACT_MASS: 224.12012
CH$SMILES: N/A
CH$IUPAC: N/A

AC$INSTRUMENT: HITACHI RMU-6D
AC$INSTRUMENT_TYPE: EI-B
AC$MASS_SPECTROMETRY: MS_TYPE MS
AC$MASS_SPECTROMETRY: ION_MODE POSITIVE
AC$MASS_SPECTROMETRY: IONIZATION_ENERGY 70 eV

MS$FOCUSED_ION: ION_TYPE [M]+*

PK$SPLASH: splash10-05fr-0970000000-f3f2bdc9d32c7e9bbbdf
PK$NUM_PEAK: 30
PK$PEAK: m/z int. rel.int.
  91 10 100
  92 1 10
  104 1 10
  105 0.1 1
  116 0.5 5
  118 0.5 5
  119 0.3 3
  120 99.99 999
  121 8 80
  122 0.7 7
  128 2.3 23
  129 0.07 1
  130 0.3 3
  132 1 10
  133 5 50
  134 0.07 1
  146 6 60
  147 0.7 7
  191 1 10
  196 0.13 1
  204 1 10
  205 3 30
  206 93 930
  207 1.6 16
  208 2 20
  222 0.3 3
  223 1 10
  224 3 30
  225 5 50
  226 1 10