ACCESSION: MSBNK-Fac_Eng_Univ_Tokyo-JP000357
RECORD_TITLE: 1,2,3,4-TETRAHYDRO-TRANS-3-PHENYL-1-NAPHTHOL; EI-B; MS
DATE: 2016.01.19 (Created 2008.10.21, modified 2011.05.06)
AUTHORS: SASAKI S, TOYOHASHI UNIV. OF TECH.
LICENSE: CC BY-NC-SA

CH$NAME: 1,2,3,4-TETRAHYDRO-TRANS-3-PHENYL-1-NAPHTHOL
CH$COMPOUND_CLASS: N/A
CH$FORMULA: C16H16O
CH$EXACT_MASS: 224.12012
CH$SMILES: N/A
CH$IUPAC: N/A

AC$INSTRUMENT: HITACHI RMU-6D
AC$INSTRUMENT_TYPE: EI-B
AC$MASS_SPECTROMETRY: MS_TYPE MS
AC$MASS_SPECTROMETRY: ION_MODE POSITIVE
AC$MASS_SPECTROMETRY: IONIZATION_ENERGY 70 eV

MS$FOCUSED_ION: ION_TYPE [M]+*

PK$SPLASH: splash10-0a4i-1590000000-da1197e45ea3ddcd2df1
PK$NUM_PEAK: 36
PK$PEAK: m/z int. rel.int.
  91 23 230
  92 1 10
  104 2 20
  105 0.1 1
  115 1 10
  116 0.3 3
  117 0.3 3
  118 0.1 1
  119 4 40
  120 24 240
  121 2 20
  122 0.03 0
  128 8 80
  129 3 30
  130 0.3 3
  131 0.17 2
  132 0.7 7
  133 1 10
  141 0.7 7
  145 0.2 2
  146 32 320
  147 4 40
  148 0.3 3
  191 0.3 3
  192 0.7 7
  204 0.7 7
  205 5 50
  206 99.99 999
  207 17 170
  208 2.3 23
  209 1 10
  222 0.07 1
  223 1 10
  224 19 190
  225 3 30
  226 1 10