ACCESSION: MSBNK-Fac_Eng_Univ_Tokyo-JP000377
RECORD_TITLE: 1,1-DIMETHYLHYDRAZINE; EI-B; MS
DATE: 2016.01.19 (Created 2008.10.21, modified 2011.05.06)
AUTHORS: SASAKI S, TOYOHASHI UNIV. OF TECH.
LICENSE: CC BY-NC-SA

CH$NAME: 1,1-DIMETHYLHYDRAZINE
CH$COMPOUND_CLASS: N/A
CH$FORMULA: C2H8N2
CH$EXACT_MASS: 60.06875
CH$SMILES: CN(C)N
CH$IUPAC: InChI=1S/C2H8N2/c1-4(2)3/h3H2,1-2H3
CH$LINK: INCHIKEY RHUYHJGZWVXEHW-UHFFFAOYSA-N
CH$LINK: COMPTOX DTXSID1020516

AC$INSTRUMENT: SHIMADZU LKB-2091
AC$INSTRUMENT_TYPE: EI-B
AC$MASS_SPECTROMETRY: MS_TYPE MS
AC$MASS_SPECTROMETRY: ION_MODE POSITIVE
AC$MASS_SPECTROMETRY: IONIZATION_ENERGY 70 eV

MS$FOCUSED_ION: ION_TYPE [M]+*

PK$SPLASH: splash10-03di-9000000000-420219681bd3aa9f101f
PK$NUM_PEAK: 17
PK$PEAK: m/z int. rel.int.
  27 3.8 38
  28 27.5 275
  29 7.6 76
  30 2.65 27
  31 4.6 46
  40 3 30
  41 4.3 43
  42 6.17 62
  43 25.3 253
  44 11.9 119
  45 45.9 459
  46 0.1 1
  57 1.5 15
  58 1.3 13
  59 48.5 485
  60 99.99 999
  61 3.9 39