ACCESSION: MSBNK-Fac_Eng_Univ_Tokyo-JP000389
RECORD_TITLE: 1,1-DIISOBUTYLHYDRAZINE; EI-B; MS
DATE: 2016.01.19 (Created 2008.10.21, modified 2011.05.06)
AUTHORS: SASAKI S, TOYOHASHI UNIV. OF TECH.
LICENSE: CC BY-NC-SA

CH$NAME: 1,1-DIISOBUTYLHYDRAZINE
CH$COMPOUND_CLASS: N/A
CH$FORMULA: C8H20N2
CH$EXACT_MASS: 144.16265
CH$SMILES: CC(C)CN(N)CC(C)C
CH$IUPAC: InChI=1S/C8H20N2/c1-7(2)5-10(9)6-8(3)4/h7-8H,5-6,9H2,1-4H3
CH$LINK: INCHIKEY JDAGVHRXQORNKW-UHFFFAOYSA-N
CH$LINK: COMPTOX DTXSID80168051

AC$INSTRUMENT: SHIMADZU LKB-2091
AC$INSTRUMENT_TYPE: EI-B
AC$MASS_SPECTROMETRY: MS_TYPE MS
AC$MASS_SPECTROMETRY: ION_MODE POSITIVE
AC$MASS_SPECTROMETRY: IONIZATION_ENERGY 70 eV

MS$FOCUSED_ION: ION_TYPE [M]+*

PK$SPLASH: splash10-0udj-9500000000-a2b066bc800280700499
PK$NUM_PEAK: 28
PK$PEAK: m/z int. rel.int.
  27 6.2 62
  28 1.9 19
  29 15.4 154
  30 0.29 3
  31 1.8 18
  39 4.9 49
  41 17.9 179
  42 0.58 6
  43 5.8 58
  44 4.4 44
  45 98.6 986
  46 0.23 2
  55 2.9 29
  56 1.9 19
  57 37.1 371
  58 0.32 3
  59 1.5 15
  69 1 10
  73 1.3 13
  84 0.18 2
  85 1.2 12
  86 1.2 12
  87 1.3 13
  101 99.99 999
  102 7.2 72
  129 0.7 7
  144 14.1 141
  145 2 20