ACCESSION: MSBNK-Fac_Eng_Univ_Tokyo-JP000390
RECORD_TITLE: 1,1-PENTAMETHYLENEHYDRAZINE; EI-B; MS
DATE: 2016.01.19 (Created 2008.10.21, modified 2011.05.06)
AUTHORS: SASAKI S, TOYOHASHI UNIV. OF TECH.
LICENSE: CC BY-NC-SA

CH$NAME: 1,1-PENTAMETHYLENEHYDRAZINE
CH$NAME: 1-AMINOPIPERIDINE
CH$COMPOUND_CLASS: N/A
CH$FORMULA: C5H12N2
CH$EXACT_MASS: 100.10005
CH$SMILES: NN(C1)CCCC1
CH$IUPAC: InChI=1S/C5H12N2/c6-7-4-2-1-3-5-7/h1-6H2
CH$LINK: INCHIKEY LWMPFIOTEAXAGV-UHFFFAOYSA-N
CH$LINK: COMPTOX DTXSID60176654

AC$INSTRUMENT: SHIMADZU LKB-2091
AC$INSTRUMENT_TYPE: EI-B
AC$MASS_SPECTROMETRY: MS_TYPE MS
AC$MASS_SPECTROMETRY: ION_MODE POSITIVE
AC$MASS_SPECTROMETRY: IONIZATION_ENERGY 70 eV

MS$FOCUSED_ION: ION_TYPE [M]+*

PK$SPLASH: splash10-0f6t-9200000000-07c6b5ad8f3f65e73542
PK$NUM_PEAK: 34
PK$PEAK: m/z int. rel.int.
  26 2.1 21
  27 13.8 138
  28 4.6 46
  29 1 10
  30 7.9 79
  31 2.5 25
  39 9.5 95
  40 0.18 2
  41 15.9 159
  42 19.2 192
  43 15.9 159
  44 6.93 69
  45 13.3 133
  53 2.1 21
  54 4.1 41
  55 2.21 22
  56 6.9 69
  57 8.5 85
  58 11 110
  59 1.23 12
  67 1.2 12
  68 1 10
  69 1.2 12
  70 0.16 2
  71 4.4 44
  72 2.3 23
  82 3.9 39
  83 0.17 2
  84 7.7 77
  85 4.1 41
  98 1.4 14
  99 99.99 999
  100 72 720
  101 5.9 59