ACCESSION: MSBNK-Fac_Eng_Univ_Tokyo-JP000394
RECORD_TITLE: 1,1-DIALLYLHYDRAZINE; EI-B; MS
DATE: 2016.01.19 (Created 2008.10.21, modified 2011.05.06)
AUTHORS: SASAKI S, TOYOHASHI UNIV. OF TECH.
LICENSE: CC BY-NC-SA

CH$NAME: 1,1-DIALLYLHYDRAZINE
CH$COMPOUND_CLASS: N/A
CH$FORMULA: C6H12N2
CH$EXACT_MASS: 112.10005
CH$SMILES: C=CCN(N)CC=C
CH$IUPAC: InChI=1S/C6H12N2/c1-3-5-8(7)6-4-2/h3-4H,1-2,5-7H2
CH$LINK: INCHIKEY UPVLRUMEBXYJMQ-UHFFFAOYSA-N
CH$LINK: COMPTOX DTXSID2020393

AC$INSTRUMENT: SHIMADZU LKB-2091
AC$INSTRUMENT_TYPE: EI-B
AC$MASS_SPECTROMETRY: MS_TYPE MS
AC$MASS_SPECTROMETRY: ION_MODE POSITIVE
AC$MASS_SPECTROMETRY: IONIZATION_ENERGY 70 eV

MS$FOCUSED_ION: ION_TYPE [M]+*

PK$SPLASH: splash10-0006-9000000000-4e58b22b33b6d96b320e
PK$NUM_PEAK: 25
PK$PEAK: m/z int. rel.int.
  27 31 310
  29 16.4 164
  30 7.6 76
  31 1.28 13
  38 2.5 25
  39 29.3 293
  40 3.6 36
  41 99.99 999
  42 10.7 107
  43 16.7 167
  44 21.5 215
  45 0.7 7
  54 6.7 67
  55 4.1 41
  56 7.4 74
  57 0.19 2
  67 1 10
  68 1.8 18
  69 2.3 23
  70 0.16 2
  71 47.9 479
  72 6.9 69
  85 5.4 54
  112 1.98 20
  113 1.8 18