ACCESSION: MSBNK-Fac_Eng_Univ_Tokyo-JP000395
RECORD_TITLE: 1,1-DICROTYLHYDRAZINE; EI-B; MS
DATE: 2016.01.19 (Created 2008.10.21, modified 2011.05.06)
AUTHORS: SASAKI S, TOYOHASHI UNIV. OF TECH.
LICENSE: CC BY-NC-SA

CH$NAME: 1,1-DICROTYLHYDRAZINE
CH$NAME: 1,1-DI(2-BUTENYL)HYDRAZINE
CH$COMPOUND_CLASS: N/A
CH$FORMULA: C8H16N2
CH$EXACT_MASS: 140.13135
CH$SMILES: CC=CCN(N)CC=CC
CH$IUPAC: InChI=1S/C8H16N2/c1-3-5-7-10(9)8-6-4-2/h3-6H,7-9H2,1-2H3/b5-3+,6-4+
CH$LINK: INCHIKEY HCVMGJBOKUBGRJ-GGWOSOGESA-N

AC$INSTRUMENT: SHIMADZU LKB-2091
AC$INSTRUMENT_TYPE: EI-B
AC$MASS_SPECTROMETRY: MS_TYPE MS
AC$MASS_SPECTROMETRY: ION_MODE POSITIVE
AC$MASS_SPECTROMETRY: IONIZATION_ENERGY 70 eV

MS$FOCUSED_ION: ION_TYPE [M]+*

PK$SPLASH: splash10-0553-9000000000-23488172df96c7f9800e
PK$NUM_PEAK: 41
PK$PEAK: m/z int. rel.int.
  28 15.7 157
  29 54 540
  30 8.8 88
  31 0.62 6
  32 4.2 42
  38 1.1 11
  39 23.2 232
  40 0.24 2
  41 62.1 621
  42 19.4 194
  43 33.8 338
  44 3.25 33
  45 16.8 168
  50 1.1 11
  51 2.4 24
  52 0.15 2
  53 9.5 95
  54 4.3 43
  55 81.1 811
  56 1.49 15
  57 3.4 34
  58 8.8 88
  59 0.8 8
  67 0.32 3
  68 43.2 432
  69 10.2 102
  70 2.3 23
  71 0.25 3
  80 0.8 8
  81 0.8 8
  82 1 10
  83 0.34 3
  84 2.3 23
  85 99.99 999
  86 10.5 105
  97 0.08 1
  99 1.9 19
  108 0.8 8
  125 2.3 23
  140 4.6 46
  141 6.5 65