ACCESSION: MSBNK-Fac_Eng_Univ_Tokyo-JP000508
RECORD_TITLE: 1,1-DIMETHYL-2-(1-METHYLBUTYL)HYDRAZINE; EI-B; MS
DATE: 2016.01.19 (Created 2008.10.21, modified 2011.05.06)
AUTHORS: SASAKI S, TOYOHASHI UNIV. OF TECH.
LICENSE: CC BY-NC-SA

CH$NAME: 1,1-DIMETHYL-2-(1-METHYLBUTYL)HYDRAZINE
CH$COMPOUND_CLASS: N/A
CH$FORMULA: C7H18N2
CH$EXACT_MASS: 130.14700
CH$SMILES: CCCC(C)NN(C)C
CH$IUPAC: InChI=1S/C7H18N2/c1-5-6-7(2)8-9(3)4/h7-8H,5-6H2,1-4H3
CH$LINK: INCHIKEY RQRHTWNEYRZHQK-UHFFFAOYSA-N

AC$INSTRUMENT: SHIMADZU LKB-2091
AC$INSTRUMENT_TYPE: EI-B
AC$MASS_SPECTROMETRY: MS_TYPE MS
AC$MASS_SPECTROMETRY: ION_MODE POSITIVE
AC$MASS_SPECTROMETRY: IONIZATION_ENERGY 70 eV

MS$FOCUSED_ION: ION_TYPE [M]+*

PK$SPLASH: splash10-0a4i-9100000000-5f831a5839848fdd4567
PK$NUM_PEAK: 32
PK$PEAK: m/z int. rel.int.
  27 4.4 44
  28 3.4 34
  29 3.3 33
  30 0.37 4
  39 1.7 17
  40 0.4 4
  41 3.9 39
  42 0.79 8
  43 9.3 93
  44 20.4 204
  45 13.9 139
  46 0.22 2
  55 0.8 8
  56 0.7 7
  57 12 120
  58 0.3 3
  59 99.99 999
  60 14.8 148
  61 0.6 6
  70 0.1 1
  71 1.4 14
  72 0.7 7
  73 0.9 9
  85 0.08 1
  86 1.4 14
  87 22.2 222
  88 1.4 14
  101 0.03 0
  115 3.7 37
  116 0.6 6
  130 27.8 278
  131 3.6 36