ACCESSION: MSBNK-Fac_Eng_Univ_Tokyo-JP000510
RECORD_TITLE: 1,1-DIETHYL-2-PROPYLHYDRAZINE; EI-B; MS
DATE: 2016.01.19 (Created 2008.10.21, modified 2011.05.06)
AUTHORS: SASAKI S, TOYOHASHI UNIV. OF TECH.
LICENSE: CC BY-NC-SA

CH$NAME: 1,1-DIETHYL-2-PROPYLHYDRAZINE
CH$COMPOUND_CLASS: N/A
CH$FORMULA: C7H18N2
CH$EXACT_MASS: 130.14700
CH$SMILES: CCCNN(CC)CC
CH$IUPAC: InChI=1S/C7H18N2/c1-4-7-8-9(5-2)6-3/h8H,4-7H2,1-3H3
CH$LINK: INCHIKEY YFTVJZZMQIPLDM-UHFFFAOYSA-N
CH$LINK: COMPTOX DTXSID20986675

AC$INSTRUMENT: SHIMADZU LKB-2091
AC$INSTRUMENT_TYPE: EI-B
AC$MASS_SPECTROMETRY: MS_TYPE MS
AC$MASS_SPECTROMETRY: ION_MODE POSITIVE
AC$MASS_SPECTROMETRY: IONIZATION_ENERGY 70 eV

MS$FOCUSED_ION: ION_TYPE [M]+*

PK$SPLASH: splash10-0019-9200000000-0f342651babfbc36446c
PK$NUM_PEAK: 39
PK$PEAK: m/z int. rel.int.
  27 20.6 206
  28 14.2 142
  29 22.2 222
  30 2.38 24
  31 15.8 158
  32 2.4 24
  39 2.5 25
  40 0.11 1
  41 11.9 119
  42 20.6 206
  43 17.4 174
  44 2.7 27
  45 5.6 56
  46 1.4 14
  54 1.1 11
  55 0.08 1
  56 10.3 103
  57 5.8 58
  58 28.5 285
  59 5.71 57
  60 3.5 35
  70 2.2 22
  71 3.3 33
  72 0.84 8
  73 14.3 143
  74 0.9 9
  85 1.7 17
  86 0.13 1
  87 99.99 999
  88 6 60
  99 0.5 5
  101 2.06 21
  102 2.7 27
  113 1 10
  115 22.2 222
  116 0.19 2
  129 1 10
  130 55.6 556
  131 6.7 67