ACCESSION: MSBNK-Fac_Eng_Univ_Tokyo-JP000513
RECORD_TITLE: 1,1-DIETHYL-2-PENTYLHYDRAZINE; EI-B; MS
DATE: 2016.01.19 (Created 2008.10.21, modified 2011.05.06)
AUTHORS: SASAKI S, TOYOHASHI UNIV. OF TECH.
LICENSE: CC BY-NC-SA

CH$NAME: 1,1-DIETHYL-2-PENTYLHYDRAZINE
CH$COMPOUND_CLASS: N/A
CH$FORMULA: C9H22N2
CH$EXACT_MASS: 158.17830
CH$SMILES: CCCCCNN(CC)CC
CH$IUPAC: InChI=1S/C9H22N2/c1-4-7-8-9-10-11(5-2)6-3/h10H,4-9H2,1-3H3
CH$LINK: INCHIKEY MVMRYSSNWDNQEZ-UHFFFAOYSA-N

AC$INSTRUMENT: SHIMADZU LKB-2091
AC$INSTRUMENT_TYPE: EI-B
AC$MASS_SPECTROMETRY: MS_TYPE MS
AC$MASS_SPECTROMETRY: ION_MODE POSITIVE
AC$MASS_SPECTROMETRY: IONIZATION_ENERGY 70 eV

MS$FOCUSED_ION: ION_TYPE [M]+*

PK$SPLASH: splash10-052r-9300000000-4d871ec4be143d617f73
PK$NUM_PEAK: 42
PK$PEAK: m/z int. rel.int.
  27 5.8 58
  28 3.9 39
  29 12.2 122
  30 1.1 11
  31 4.9 49
  32 1 10
  39 1.7 17
  41 0.58 6
  42 8.4 84
  43 12.2 122
  44 11.6 116
  45 0.23 2
  46 0.5 5
  55 1.5 15
  56 5.1 51
  57 0.34 3
  58 6.5 65
  59 24.5 245
  60 1.6 16
  69 0.1 1
  70 1.5 15
  71 2.8 28
  72 3.6 36
  73 2.26 23
  74 1.4 14
  84 0.9 9
  85 1.6 16
  86 0.21 2
  87 99.99 999
  88 5.2 52
  99 0.5 5
  100 0.06 1
  101 12.9 129
  102 0.9 9
  115 0.4 4
  129 1.3 13
  130 1.3 13
  143 18 180
  144 2.1 21
  157 0.08 1
  158 33.5 335
  159 5.3 53