ACCESSION: MSBNK-Fac_Eng_Univ_Tokyo-JP000571
RECORD_TITLE: HEPTADECANOIC ACID TRIMETHYLSILYL ESTER; EI-B; MS
DATE: 2016.01.19 (Created 2008.10.21, modified 2011.05.06)
AUTHORS: KOGA M, UNIV. OF OCCUPATIONAL AND ENVIRONMENTAL HEALTH
LICENSE: CC BY-NC-SA

CH$NAME: HEPTADECANOIC ACID TRIMETHYLSILYL ESTER
CH$COMPOUND_CLASS: N/A
CH$FORMULA: C20H42O2Si
CH$EXACT_MASS: 342.29541
CH$SMILES: CCCCCCCCCCCCCCCCC(=O)O[Si](C)(C)C
CH$IUPAC: InChI=1S/C20H42O2Si/c1-5-6-7-8-9-10-11-12-13-14-15-16-17-18-19-20(21)22-23(2,3)4/h5-19H2,1-4H3
CH$LINK: CAS 55517-58-3
CH$LINK: INCHIKEY KCEZRIREPDDPDI-UHFFFAOYSA-N

AC$INSTRUMENT: JEOL JMS-01-SG
AC$INSTRUMENT_TYPE: EI-B
AC$MASS_SPECTROMETRY: MS_TYPE MS
AC$MASS_SPECTROMETRY: ION_MODE POSITIVE
AC$MASS_SPECTROMETRY: IONIZATION_ENERGY 70 eV

MS$FOCUSED_ION: ION_TYPE [M]+*

PK$SPLASH: splash10-004l-9400000000-6066e276b259f23368f9
PK$NUM_PEAK: 22
PK$PEAK: m/z int. rel.int.
  41 50 500
  43 38.9 389
  55 23.7 237
  56 1.94 19
  69 16.9 169
  70 17.7 177
  73 32.2 322
  75 99.99 999
  76 19.4 194
  79 18.6 186
  81 10.1 101
  85 1.94 19
  95 21.1 211
  105 20.3 203
  109 17.7 177
  111 1.94 19
  117 58.4 584
  129 41.5 415
  132 27.9 279
  145 1.44 14
  207 11.8 118
  327 22.8 228