ACCESSION: MSBNK-Fac_Eng_Univ_Tokyo-JP000574
RECORD_TITLE: EICOSANOIC ACID TRIMETHYLSILYL ESTER; EI-B; MS
DATE: 2016.01.19 (Created 2008.10.21, modified 2011.05.06)
AUTHORS: KOGA M, UNIV. OF OCCUPATIONAL AND ENVIRONMENTAL HEALTH
LICENSE: CC BY-NC-SA

CH$NAME: EICOSANOIC ACID TRIMETHYLSILYL ESTER
CH$COMPOUND_CLASS: N/A
CH$FORMULA: C23H48O2Si
CH$EXACT_MASS: 384.34236
CH$SMILES: CCCCCCCCCCCCCCCCCCCC(=O)O[Si](C)(C)C
CH$IUPAC: InChI=1S/C23H48O2Si/c1-5-6-7-8-9-10-11-12-13-14-15-16-17-18-19-20-21-22-23(24)25-26(2,3)4/h5-22H2,1-4H3
CH$LINK: CAS 55530-70-6
CH$LINK: INCHIKEY AYSGFBVOWSXJCN-UHFFFAOYSA-N
CH$LINK: COMPTOX DTXSID30334704

AC$INSTRUMENT: JEOL JMS-01-SG
AC$INSTRUMENT_TYPE: EI-B
AC$MASS_SPECTROMETRY: MS_TYPE MS
AC$MASS_SPECTROMETRY: ION_MODE POSITIVE
AC$MASS_SPECTROMETRY: IONIZATION_ENERGY 70 eV

MS$FOCUSED_ION: ION_TYPE [M]+*

PK$SPLASH: splash10-01e9-9610000000-9c498a62c7ed6c4756c3
PK$NUM_PEAK: 25
PK$PEAK: m/z int. rel.int.
  43 28.6 286
  45 10.5 105
  55 29.6 296
  56 0.95 10
  57 10 100
  67 10.5 105
  69 20.7 207
  71 1.08 11
  73 88.8 888
  74 11.5 115
  75 70.7 707
  83 1.31 13
  95 10.5 105
  117 99.99 999
  118 10.5 105
  129 4.57 46
  131 19.4 194
  132 49.7 497
  133 13.1 131
  145 4.21 42
  201 12.5 125
  209 17.4 174
  220 17.1 171
  369 6.08 61
  370 19.4 194