ACCESSION: MSBNK-Fac_Eng_Univ_Tokyo-JP000582
RECORD_TITLE: OLEIC ACID TRIMETHYLSILYL ESTER; EI-B; MS
DATE: 2016.01.19 (Created 2008.10.21, modified 2011.05.06)
AUTHORS: KOGA M, UNIV. OF OCCUPATIONAL AND ENVIRONMENTAL HEALTH
LICENSE: CC BY-NC-SA

CH$NAME: OLEIC ACID TRIMETHYLSILYL ESTER
CH$NAME: CIS-9-OCTADECENOIC ACID TRIMETHYLSILYL ESTER
CH$COMPOUND_CLASS: N/A
CH$FORMULA: C21H42O2Si
CH$EXACT_MASS: 354.29541
CH$SMILES: CCCCCCCCC=CCCCCCCCC(=O)O[Si](C)(C)C
CH$IUPAC: InChI=1S/C21H42O2Si/c1-5-6-7-8-9-10-11-12-13-14-15-16-17-18-19-20-21(22)23-24(2,3)4/h12-13H,5-11,14-20H2,1-4H3/b13-12-
CH$LINK: INCHIKEY GAODWSYPSJBKGB-SEYXRHQNSA-N

AC$INSTRUMENT: JEOL JMS-01-SG
AC$INSTRUMENT_TYPE: EI-B
AC$MASS_SPECTROMETRY: MS_TYPE MS
AC$MASS_SPECTROMETRY: ION_MODE POSITIVE
AC$MASS_SPECTROMETRY: IONIZATION_ENERGY 70 eV

MS$FOCUSED_ION: ION_TYPE [M]+*

PK$SPLASH: splash10-00vj-9300000000-82e8a94947f53154c4c7
PK$NUM_PEAK: 43
PK$PEAK: m/z int. rel.int.
  43 11.8 118
  45 11.1 111
  47 10.2 102
  54 1.16 12
  55 57.1 571
  56 11.1 111
  57 19.1 191
  61 1.07 11
  67 40.1 401
  68 13.3 133
  69 31.6 316
  71 1.07 11
  73 99.99 999
  74 10.7 107
  75 70 700
  76 1.06 11
  79 10.7 107
  81 22.7 227
  82 16.9 169
  83 2.54 25
  84 31.6 316
  85 10.2 102
  93 11.1 111
  95 2.27 23
  96 33.4 334
  97 26.7 267
  98 21.4 214
  105 1.07 11
  109 13.8 138
  110 18.3 183
  111 11.1 111
  117 6.42 64
  118 12.5 125
  119 12.5 125
  121 10.7 107
  123 1.11 11
  129 56.2 562
  131 11.1 111
  145 35.2 352
  147 11.1 111
  199 10.7 107
  339 2.9 29
  340 9.8 98