ACCESSION: MSBNK-Fac_Eng_Univ_Tokyo-JP000961
RECORD_TITLE: ETHYLBENZENE; EI-B; MS
DATE: 2016.01.19 (Created 2008.10.21, modified 2011.05.06)
AUTHORS: KOGA M, UNIV. OF OCCUPATIONAL AND ENVIRONMENTAL HEALTH
LICENSE: CC BY-NC-SA

CH$NAME: ETHYLBENZENE
CH$COMPOUND_CLASS: N/A
CH$FORMULA: C8H10
CH$EXACT_MASS: 106.07825
CH$SMILES: CCc(c1)cccc1
CH$IUPAC: InChI=1S/C8H10/c1-2-8-6-4-3-5-7-8/h3-7H,2H2,1H3
CH$LINK: CAS 100-41-4
CH$LINK: INCHIKEY YNQLUTRBYVCPMQ-UHFFFAOYSA-N
CH$LINK: COMPTOX DTXSID3020596

AC$INSTRUMENT: JEOL JMS-01-SG
AC$INSTRUMENT_TYPE: EI-B
AC$MASS_SPECTROMETRY: MS_TYPE MS
AC$MASS_SPECTROMETRY: ION_MODE POSITIVE
AC$MASS_SPECTROMETRY: IONIZATION_ENERGY 70 eV

MS$FOCUSED_ION: ION_TYPE [M]+*

PK$SPLASH: splash10-0006-9000000000-e311097b1353d1f46e6e
PK$NUM_PEAK: 17
PK$PEAK: m/z int. rel.int.
  39 6.5 65
  50 5.3 53
  51 10.7 107
  52 0.35 4
  62 2 20
  63 4.9 49
  65 10.9 109
  77 0.92 9
  78 8 80
  79 4.2 42
  89 2.8 28
  91 99.99 999
  92 7.6 76
  103 3.1 31
  105 4.5 45
  106 2.73 27
  107 2.5 25