ACCESSION: MSBNK-Fac_Eng_Univ_Tokyo-JP001049
RECORD_TITLE: TRANS-11-OCTADECENOIC ACID TRIMETHYLSILYLESTER; EI-B; MS
DATE: 2016.01.19 (Created 2008.10.21, modified 2011.05.06)
AUTHORS: KOGA M, UNIV. OF OCCUPATIONAL AND ENVIRONMENTAL HEALTH
LICENSE: CC BY-NC-SA

CH$NAME: TRANS-11-OCTADECENOIC ACID TRIMETHYLSILYLESTER
CH$NAME: TRIMETHYLSILYL TRANS-11-OCTADECENOATE
CH$COMPOUND_CLASS: N/A
CH$FORMULA: C21H42O2Si
CH$EXACT_MASS: 354.29541
CH$SMILES: N/A
CH$IUPAC: N/A

AC$INSTRUMENT: JEOL JMS-01-SG
AC$INSTRUMENT_TYPE: EI-B
AC$MASS_SPECTROMETRY: MS_TYPE MS
AC$MASS_SPECTROMETRY: ION_MODE POSITIVE
AC$MASS_SPECTROMETRY: IONIZATION_ENERGY 70 eV

MS$FOCUSED_ION: ION_TYPE [M]+*

PK$SPLASH: splash10-00vi-9501000000-cfe31155135ce93431af
PK$NUM_PEAK: 18
PK$PEAK: m/z int. rel.int.
  55 48 480
  67 15.3 153
  69 30.7 307
  73 99.99 999
  75 69.2 692
  77 1.9 19
  81 28.8 288
  95 1.34 13
  96 13.4 134
  117 88.4 884
  129 61.5 615
  131 1.53 15
  132 23 230
  145 28.8 288
  264 13.4 134
  339 6.15 62
  340 15.3 153
  341 21.1 211