ACCESSION: MSBNK-Fac_Eng_Univ_Tokyo-JP001080
RECORD_TITLE: HEPTADECANEDIOIC ACID BIS(TRIMETHYLSILYL)ESTER; EI-B; MS
DATE: 2016.01.19 (Created 2008.10.21, modified 2011.05.06)
AUTHORS: KOGA M, UNIV. OF OCCUPATIONAL AND ENVIRONMENTAL HEALTH
LICENSE: CC BY-NC-SA

CH$NAME: HEPTADECANEDIOIC ACID BIS(TRIMETHYLSILYL)ESTER
CH$NAME: DI(TRIMETHYLSILYL) HEPTADECANEDIOATE
CH$COMPOUND_CLASS: N/A
CH$FORMULA: C23H48O4Si2
CH$EXACT_MASS: 444.30911
CH$SMILES: N/A
CH$IUPAC: N/A

AC$INSTRUMENT: JEOL JMS-01-SG
AC$INSTRUMENT_TYPE: EI-B
AC$MASS_SPECTROMETRY: MS_TYPE MS
AC$MASS_SPECTROMETRY: ION_MODE POSITIVE
AC$MASS_SPECTROMETRY: IONIZATION_ENERGY 70 eV

MS$FOCUSED_ION: ION_TYPE [M]+*

PK$SPLASH: splash10-00b9-9110000000-6b4c8a4a27bfa6f5b4f6
PK$NUM_PEAK: 22
PK$PEAK: m/z int. rel.int.
  45 10.3 103
  47 12.2 122
  55 32 320
  67 1.31 13
  69 19.7 197
  73 95.3 953
  74 10.7 107
  75 99.99 999
  77 13.1 131
  81 16.9 169
  83 16.4 164
  95 1.59 16
  97 13.1 131
  117 27.6 276
  129 23 230
  147 1.17 12
  149 13.6 136
  204 29.5 295
  217 20.6 206
  313 0.65 7
  429 23 230
  430 5.1 51