ACCESSION: MSBNK-Fac_Eng_Univ_Tokyo-JP001234
RECORD_TITLE: 1,2,3,4-TETRAHYDRO-TRANS-3-METHYLNAPHTHALEN-1-OL; EI-B; MS
DATE: 2016.01.19 (Created 2008.10.21, modified 2011.05.06)
AUTHORS: SASAKI S, TOYOHASHI UNIV. OF TECH.
LICENSE: CC BY-NC-SA

CH$NAME: 1,2,3,4-TETRAHYDRO-TRANS-3-METHYLNAPHTHALEN-1-OL
CH$COMPOUND_CLASS: N/A
CH$FORMULA: C11H14O
CH$EXACT_MASS: 162.10447
CH$SMILES: N/A
CH$IUPAC: N/A

AC$INSTRUMENT: HITACHI RMU-6D
AC$INSTRUMENT_TYPE: EI-B
AC$MASS_SPECTROMETRY: MS_TYPE MS
AC$MASS_SPECTROMETRY: ION_MODE POSITIVE
AC$MASS_SPECTROMETRY: IONIZATION_ENERGY 70 eV

MS$FOCUSED_ION: ION_TYPE [M]+*

PK$SPLASH: splash10-004l-2900000000-9e1d6ece1c3eca9dbc14
PK$NUM_PEAK: 72
PK$PEAK: m/z int. rel.int.
  50 3 30
  51 11 110
  52 3 30
  53 0.2 2
  54 0.7 7
  55 1.7 17
  56 0.3 3
  57 0.03 0
  58 0.3 3
  60 0.3 3
  61 0.3 3
  62 0.2 2
  63 9 90
  64 3.7 37
  65 13 130
  66 0.13 1
  67 0.7 7
  69 1 10
  70 0.3 3
  71 0.2 2
  72 0.7 7
  73 0.3 3
  74 2 20
  75 0.3 3
  76 3 30
  77 14 140
  78 8.3 83
  79 0.33 3
  86 0.7 7
  87 1 10
  88 1 10
  89 0.8 8
  90 5 50
  91 44.3 443
  92 10 100
  93 0.1 1
  101 2 20
  102 4.7 47
  103 4.7 47
  104 0.13 1
  105 10.7 107
  106 1 10
  107 0.7 7
  113 0.07 1
  114 0.7 7
  115 19 190
  116 6 60
  117 0.63 6
  118 5 50
  119 42 420
  120 51 510
  121 0.53 5
  126 2 20
  127 14 140
  128 37.3 373
  129 99.99 999
  130 11 110
  131 3.3 33
  132 0.7 7
  133 0.13 1
  139 1.7 17
  140 0.7 7
  141 4.3 43
  142 0.2 2
  143 9.7 97
  144 59 590
  145 9.7 97
  146 0.1 1
  147 1 10
  162 15 150
  163 14.3 143
  164 2 20