ACCESSION: MSBNK-Fac_Eng_Univ_Tokyo-JP001239
RECORD_TITLE: 1,2,3,4-TETRAHYDRO-TRANS-3-METHYL-1-NAPHTHYL ACETATE; EI-B; MS
DATE: 2016.01.19 (Created 2008.10.21, modified 2011.05.06)
AUTHORS: SASAKI S, TOYOHASHI UNIV. OF TECH.
LICENSE: CC BY-NC-SA

CH$NAME: 1,2,3,4-TETRAHYDRO-TRANS-3-METHYL-1-NAPHTHYL ACETATE
CH$COMPOUND_CLASS: N/A
CH$FORMULA: C13H16O2
CH$EXACT_MASS: 204.11503
CH$SMILES: N/A
CH$IUPAC: N/A

AC$INSTRUMENT: HITACHI RMU-6D
AC$INSTRUMENT_TYPE: EI-B
AC$MASS_SPECTROMETRY: MS_TYPE MS
AC$MASS_SPECTROMETRY: ION_MODE POSITIVE
AC$MASS_SPECTROMETRY: IONIZATION_ENERGY 15 eV

MS$FOCUSED_ION: ION_TYPE [M]+*

PK$SPLASH: splash10-0006-0900000000-86a5c0e5bd835748a3fd
PK$NUM_PEAK: 12
PK$PEAK: m/z int. rel.int.
  120 6 60
  128 0.7 7
  129 44 440
  130 0.5 5
  143 2 20
  144 99.99 999
  145 17 170
  146 0.1 1
  161 1 10
  162 19 190
  163 2 20
  204 1 10