ACCESSION: MSBNK-Fac_Eng_Univ_Tokyo-JP001243
RECORD_TITLE: 1,2,3,4-TETRAHYDRO-TRANS-2-PHENYL-1-NAPHTHYL ACETATE; EI-B; MS
DATE: 2016.01.19 (Created 2008.10.21, modified 2011.05.06)
AUTHORS: SASAKI S, TOYOHASHI UNIV. OF TECH.
LICENSE: CC BY-NC-SA

CH$NAME: 1,2,3,4-TETRAHYDRO-TRANS-2-PHENYL-1-NAPHTHYL ACETATE
CH$COMPOUND_CLASS: N/A
CH$FORMULA: C18H18O2
CH$EXACT_MASS: 266.13068
CH$SMILES: N/A
CH$IUPAC: N/A

AC$INSTRUMENT: HITACHI RMU-6D
AC$INSTRUMENT_TYPE: EI-B
AC$MASS_SPECTROMETRY: MS_TYPE MS
AC$MASS_SPECTROMETRY: ION_MODE POSITIVE
AC$MASS_SPECTROMETRY: IONIZATION_ENERGY 15 eV

MS$FOCUSED_ION: ION_TYPE [M]+*

PK$SPLASH: splash10-0udl-5290000000-0dfce401a1aa20c6eea3
PK$NUM_PEAK: 20
PK$PEAK: m/z int. rel.int.
  43 2.3 23
  60 5.3 53
  91 65 650
  92 0.33 3
  107 1.3 13
  120 10.7 107
  128 15 150
  129 0.2 2
  146 2 20
  162 1.3 13
  191 5 50
  202 0.05 1
  203 2.3 23
  204 99.99 999
  205 15 150
  206 0.1 1
  222 0.3 3
  223 0.3 3
  224 3 30
  225 0.7 7