ACCESSION: MSBNK-Fac_Eng_Univ_Tokyo-JP001364
RECORD_TITLE: 1,1,2,2,3,3-HEXAMETHYL-4,5-DIPHENYL-1,2,3-TRISILACYCLOPENT-4-ENE; EI-B; MS
DATE: 2016.01.19 (Created 2008.10.21, modified 2011.05.06)
AUTHORS: MASS SPECTROSCOPY SOC. OF JAPAN (MSSJ)
LICENSE: CC BY-NC-SA

CH$NAME: 1,1,2,2,3,3-HEXAMETHYL-4,5-DIPHENYL-1,2,3-TRISILACYCLOPENT-4-ENE
CH$COMPOUND_CLASS: N/A
CH$FORMULA: C20H28Si3
CH$EXACT_MASS: 352.14988
CH$SMILES: c(c3)ccc(c3)C(=C(c(c2)cccc2)1)[Si](C)(C)[Si](C)(C)[Si](C)(C)1
CH$IUPAC: InChI=1S/C20H28Si3/c1-21(2)19(17-13-9-7-10-14-17)20(18-15-11-8-12-16-18)22(3,4)23(21,5)6/h7-16H,1-6H3
CH$LINK: INCHIKEY YSFSRQJKMIFGKF-UHFFFAOYSA-N

AC$INSTRUMENT: JEOL JMS-D-3000
AC$INSTRUMENT_TYPE: EI-B
AC$MASS_SPECTROMETRY: MS_TYPE MS
AC$MASS_SPECTROMETRY: ION_MODE POSITIVE
AC$MASS_SPECTROMETRY: IONIZATION_ENERGY 70 eV

MS$FOCUSED_ION: ION_TYPE [M]+*

PK$SPLASH: splash10-00di-6932000000-f0fead2e3cb18e0bf037
PK$NUM_PEAK: 82
PK$PEAK: m/z int. rel.int.
  40 4.81 48
  44 2.8 28
  45 8.06 81
  58 1.36 14
  59 11.76 118
  60 1.06 11
  73 99.99 999
  74 6.64 66
  75 3.33 33
  76 1 10
  77 1 10
  85 1.8 18
  99 4.07 41
  100 1.84 18
  101 5.1 51
  102 1.27 13
  105 5.85 59
  107 1.15 12
  113 1.51 15
  114 1.16 12
  115 5.76 58
  116 23.19 232
  117 6.32 63
  118 2.29 23
  119 1.31 13
  129 5.95 60
  130 1.16 12
  131 4.91 49
  133 1.4 14
  135 25.62 256
  136 3.04 30
  140 1.2 12
  143 1.06 11
  145 2.88 29
  147 1.41 14
  157 1.51 15
  159 9.02 90
  160 1.87 19
  161 1.49 15
  163 7.19 72
  164 1.32 13
  165 1.15 12
  174 5.6 56
  175 2.71 27
  176 2.63 26
  177 4.81 48
  178 25.76 258
  179 5.24 52
  180 1.78 18
  187 1.45 15
  191 2.5 25
  193 2.37 24
  197 5.55 56
  198 1.13 11
  202 4.99 50
  203 1.48 15
  204 1.08 11
  207 1.35 14
  217 7.96 80
  218 1.94 19
  219 1.43 14
  221 3.04 30
  233 1.38 14
  263 2.37 24
  264 2.57 26
  265 1.18 12
  277 2.49 25
  278 1.77 18
  279 12.84 128
  280 3.88 39
  281 1.28 13
  293 3.94 39
  294 1.54 15
  295 5.94 59
  296 1.68 17
  310 2.04 20
  337 5.15 52
  338 1.86 19
  352 31.6 316
  353 12.67 127
  354 5.49 55
  355 1.45 15