ACCESSION: MSBNK-Fac_Eng_Univ_Tokyo-JP001469
RECORD_TITLE: TRANS-1-TRIETHYLSILYL-3,3-DIMETHYL-1-BUTENE; EI-B; MS
DATE: 2016.01.19 (Created 2008.10.21, modified 2011.05.06)
AUTHORS: MASS SPECTROSCOPY SOC. OF JAPAN (MSSJ)
LICENSE: CC BY-NC-SA

CH$NAME: TRANS-1-TRIETHYLSILYL-3,3-DIMETHYL-1-BUTENE
CH$COMPOUND_CLASS: N/A
CH$FORMULA: C12H26Si
CH$EXACT_MASS: 198.18038
CH$SMILES: CC[Si](CC)(CC)C=CC(C)(C)C
CH$IUPAC: InChI=1S/C12H26Si/c1-7-13(8-2,9-3)11-10-12(4,5)6/h10-11H,7-9H2,1-6H3/b11-10+
CH$LINK: INCHIKEY NMCXIZRJYSJQHC-ZHACJKMWSA-N

AC$INSTRUMENT: JEOL JMS-D-3000
AC$INSTRUMENT_TYPE: EI-B
AC$MASS_SPECTROMETRY: MS_TYPE MS
AC$MASS_SPECTROMETRY: ION_MODE POSITIVE
AC$MASS_SPECTROMETRY: IONIZATION_ENERGY 70 eV

MS$FOCUSED_ION: ION_TYPE [M]+*

PK$SPLASH: splash10-06du-9700000000-c036ef77ffe74aef122a
PK$NUM_PEAK: 54
PK$PEAK: m/z int. rel.int.
  41 9.36 94
  43 11.52 115
  45 18.22 182
  46 1.1 11
  53 2.31 23
  54 1.19 12
  55 10.61 106
  56 3.27 33
  57 12.62 126
  58 8.18 82
  59 62.05 621
  60 5.05 51
  61 2.41 24
  63 2.24 22
  67 2.33 23
  69 6.92 69
  70 2.07 21
  71 12.99 130
  72 1.77 18
  73 33.9 339
  74 2.19 22
  75 1.45 15
  81 2.22 22
  83 6.96 70
  84 1.45 15
  85 25.87 259
  86 3.42 34
  87 33.58 336
  88 3.05 31
  89 1.28 13
  95 3.52 35
  97 7.67 77
  98 1.77 18
  99 29.39 294
  100 3.19 32
  101 8.15 82
  109 1.5 15
  111 7.63 76
  112 1.33 13
  113 28.56 286
  114 3.52 35
  115 4.88 49
  125 1.22 12
  127 8.91 89
  128 1.35 14
  139 5.53 55
  140 1.02 10
  141 68.35 684
  142 9.83 98
  143 2.7 27
  169 99.99 999
  170 16.28 163
  171 4.4 44
  198 2.92 29