ACCESSION: MSBNK-Fac_Eng_Univ_Tokyo-JP001494
RECORD_TITLE: ETHYL PROPIONATE; EI-B; MS
DATE: 2016.01.19 (Created 2008.10.21, modified 2011.05.06)
AUTHORS: YAMAMOTO M, DEP. CHEMISTRY, FAC. SCIENCE, NARA WOMEN'S UNIV.
LICENSE: CC BY-NC-SA

CH$NAME: ETHYL PROPIONATE
CH$COMPOUND_CLASS: N/A
CH$FORMULA: C5H10O2
CH$EXACT_MASS: 102.06808
CH$SMILES: CCOC(=O)CC
CH$IUPAC: InChI=1S/C5H10O2/c1-3-5(6)7-4-2/h3-4H2,1-2H3
CH$LINK: INCHIKEY FKRCODPIKNYEAC-UHFFFAOYSA-N
CH$LINK: COMPTOX DTXSID1040110

AC$INSTRUMENT: HITACHI RMU-6M
AC$INSTRUMENT_TYPE: EI-B
AC$MASS_SPECTROMETRY: MS_TYPE MS
AC$MASS_SPECTROMETRY: ION_MODE POSITIVE
AC$MASS_SPECTROMETRY: IONIZATION_ENERGY 70 eV

MS$FOCUSED_ION: ION_TYPE [M]+*

PK$SPLASH: splash10-056r-9000000000-4c782cf1377c63ba500b
PK$NUM_PEAK: 22
PK$PEAK: m/z int. rel.int.
  15 2.65 27
  26 4.52 45
  27 23.11 231
  28 14.99 150
  29 99.99 999
  30 3.19 32
  31 3.45 35
  41 1.02 10
  42 1.75 18
  43 4.28 43
  45 12.69 127
  55 1.6 16
  56 3.6 36
  57 94.27 943
  58 3.33 33
  73 5.78 58
  74 9.99 100
  75 12.29 123
  84 1.2 12
  87 1.68 17
  102 15.23 152
  103 1 10