ACCESSION: MSBNK-Fac_Eng_Univ_Tokyo-JP001812
RECORD_TITLE: N,N-DIMETHYLACETAMIDE; EI-B; MS
DATE: 2016.01.19 (Created 2008.10.21, modified 2011.05.06)
AUTHORS: TAJIMA S, GUNMA COLLEGE OF TECHNOLOGY
LICENSE: CC BY-NC-SA

CH$NAME: N,N-DIMETHYLACETAMIDE
CH$COMPOUND_CLASS: N/A
CH$FORMULA: C4H9NO
CH$EXACT_MASS: 87.06841
CH$SMILES: CN(C)C(C)=O
CH$IUPAC: InChI=1S/C4H9NO/c1-4(6)5(2)3/h1-3H3
CH$LINK: INCHIKEY FXHOOIRPVKKKFG-UHFFFAOYSA-N
CH$LINK: COMPTOX DTXSID5020499

AC$INSTRUMENT: HITACHI RMU-7M
AC$INSTRUMENT_TYPE: EI-B
AC$MASS_SPECTROMETRY: MS_TYPE MS
AC$MASS_SPECTROMETRY: ION_MODE POSITIVE
AC$MASS_SPECTROMETRY: IONIZATION_ENERGY 70 eV

MS$FOCUSED_ION: ION_TYPE [M]+*

PK$SPLASH: splash10-0006-9000000000-340f7e8d45f1b9d72a18
PK$NUM_PEAK: 13
PK$PEAK: m/z int. rel.int.
  15 6.89 69
  18 2.92 29
  28 3.21 32
  30 7.36 74
  41 1.98 20
  42 18.77 188
  43 40.19 402
  44 99.99 999
  45 21.13 211
  56 1.23 12
  72 15.66 157
  87 58.02 580
  88 4.72 47