ACCESSION: MSBNK-Fac_Eng_Univ_Tokyo-JP001930
RECORD_TITLE: 1,2-DICHLORO-1,1,2,2-TETRAMETHYLDISILANE; EI-B; MS
DATE: 2016.01.19 (Created 2008.10.21, modified 2011.05.06)
AUTHORS: MASS SPECTROSCOPY SOC. OF JAPAN (MSSJ)
LICENSE: CC BY-NC-SA

CH$NAME: 1,2-DICHLORO-1,1,2,2-TETRAMETHYLDISILANE
CH$COMPOUND_CLASS: N/A
CH$FORMULA: C4H12Cl2Si2
CH$EXACT_MASS: 185.98546
CH$SMILES: C[Si](C)(Cl)[Si](C)(C)Cl
CH$IUPAC: InChI=1S/C4H12Cl2Si2/c1-7(2,5)8(3,4)6/h1-4H3
CH$LINK: INCHIKEY SFAZXBAPWCPIER-UHFFFAOYSA-N
CH$LINK: COMPTOX DTXSID4040717

AC$INSTRUMENT: JEOL JMS-D-3000
AC$INSTRUMENT_TYPE: EI-B
AC$MASS_SPECTROMETRY: MS_TYPE MS
AC$MASS_SPECTROMETRY: ION_MODE POSITIVE
AC$MASS_SPECTROMETRY: IONIZATION_ENERGY 70 eV

MS$FOCUSED_ION: ION_TYPE [M]+*

PK$SPLASH: splash10-0abc-9000000000-59792d56622ed9679b9f
PK$NUM_PEAK: 35
PK$PEAK: m/z int. rel.int.
  42 1.92 19
  43 18.72 187
  44 2.26 23
  45 3.82 38
  53 1.13 11
  55 1.92 19
  57 1.11 11
  58 99.99 999
  59 10.84 108
  60 3.71 37
  63 9.08 91
  65 11.46 115
  67 3.2 32
  72 1.85 19
  73 69.64 696
  74 8.05 81
  75 12.84 128
  78 1.53 15
  79 1.5 15
  92 1.79 18
  93 74.16 742
  94 6.2 62
  95 26.07 261
  96 1.9 19
  133 1 10
  135 1.09 11
  151 11.49 115
  152 1.88 19
  153 4.89 49
  171 1.51 15
  173 1.08 11
  186 8.62 86
  187 1.33 13
  188 6.22 62
  190 1.31 13