ACCESSION: MSBNK-Fac_Eng_Univ_Tokyo-JP001932
RECORD_TITLE: 1,1,2,2-TETRAMETHYLDISILANE; EI-B; MS
DATE: 2016.01.19 (Created 2008.10.21, modified 2011.05.06)
AUTHORS: MASS SPECTROSCOPY SOC. OF JAPAN (MSSJ)
LICENSE: CC BY-NC-SA

CH$NAME: 1,1,2,2-TETRAMETHYLDISILANE
CH$COMPOUND_CLASS: N/A
CH$FORMULA: C4H14Si2
CH$EXACT_MASS: 118.06340
CH$SMILES: C[SiH](C)[SiH](C)C
CH$IUPAC: InChI=1S/C4H14Si2/c1-5(2)6(3)4/h5-6H,1-4H3
CH$LINK: INCHIKEY RDWAGGBALVFUHB-UHFFFAOYSA-N
CH$LINK: COMPTOX DTXSID40883591

AC$INSTRUMENT: JEOL JMS-D-3000
AC$INSTRUMENT_TYPE: EI-B
AC$MASS_SPECTROMETRY: MS_TYPE MS
AC$MASS_SPECTROMETRY: ION_MODE POSITIVE
AC$MASS_SPECTROMETRY: IONIZATION_ENERGY 70 eV

MS$FOCUSED_ION: ION_TYPE [M]+*

PK$SPLASH: splash10-0ab9-9200000000-06130a8a1e90b3c807fb
PK$NUM_PEAK: 33
PK$PEAK: m/z int. rel.int.
  42 2.13 21
  43 30.88 309
  44 4.24 42
  45 8.76 88
  53 1.92 19
  55 1.65 17
  57 2.49 25
  58 56.86 569
  59 99.99 999
  60 9.23 92
  61 3.26 33
  69 4.61 46
  70 1.69 17
  71 2.1 21
  72 1.16 12
  73 84.5 845
  74 7.52 75
  75 3.41 34
  81 1.23 12
  83 1.13 11
  85 3.47 35
  86 1.29 13
  87 2.65 27
  99 1.41 14
  101 6.92 69
  102 14.64 146
  103 30.48 305
  104 4.64 46
  105 2.18 22
  117 8.06 81
  118 30.58 306
  119 4.58 46
  120 2.05 21