ACCESSION: MSBNK-Fac_Eng_Univ_Tokyo-JP002085
RECORD_TITLE: TRANS-1-METHYL-7-METHYLENEBICYCLO(4.4.0)DECAN-3-ONE; EI-B; MS
DATE: 2016.01.19 (Created 2008.10.21, modified 2011.05.06)
AUTHORS: ENDO K, PHARMACEUTICAL INST., TOHOKU UNIV.
LICENSE: CC BY-NC-SA

CH$NAME: TRANS-1-METHYL-7-METHYLENEBICYCLO(4.4.0)DECAN-3-ONE
CH$NAME: 1-METHYL-7-METHYLENE-TRANS-DECALIN-3-ONE
CH$COMPOUND_CLASS: N/A
CH$FORMULA: C12H18O
CH$EXACT_MASS: 178.13577
CH$SMILES: N/A
CH$IUPAC: N/A

AC$INSTRUMENT: HITACHI M-52
AC$INSTRUMENT_TYPE: EI-B
AC$MASS_SPECTROMETRY: MS_TYPE MS
AC$MASS_SPECTROMETRY: ION_MODE POSITIVE
AC$MASS_SPECTROMETRY: IONIZATION_ENERGY 20 eV

MS$FOCUSED_ION: ION_TYPE [M]+*

PK$SPLASH: splash10-00vj-7900000000-be83a5ec70f0075b105b
PK$NUM_PEAK: 91
PK$PEAK: m/z int. rel.int.
  18 2.2 22
  27 2.2 22
  28 3.3 33
  29 0.44 4
  39 2.2 22
  40 2.2 22
  41 20 200
  42 0.22 2
  43 7.8 78
  44 1.1 11
  45 1.1 11
  51 0.11 1
  53 7.8 78
  54 4.4 44
  55 23.3 233
  56 0.33 3
  57 14.4 144
  58 2.2 22
  65 2.2 22
  66 0.56 6
  67 50 500
  68 54.4 544
  69 40 400
  70 0.67 7
  71 2.2 22
  72 1.1 11
  77 16.7 167
  78 0.44 4
  79 67.8 678
  80 42.2 422
  81 44.4 444
  82 2 20
  83 13.3 133
  84 3.3 33
  85 1.1 11
  86 0.11 1
  91 11.1 111
  92 11.1 111
  93 71.1 711
  94 5.56 56
  95 53.3 533
  96 15.6 156
  97 18.9 189
  98 0.33 3
  99 1.1 11
  101 7.8 78
  105 20 200
  106 0.67 7
  107 34.4 344
  108 45.6 456
  109 25.6 256
  110 4.67 47
  111 10 100
  112 2.2 22
  117 1.1 11
  118 8.44 84
  119 24.4 244
  120 72.2 722
  121 62.2 622
  122 6.56 66
  123 18.9 189
  124 14.4 144
  125 1.1 11
  126 0.11 1
  127 1.1 11
  130 1.1 11
  131 5.6 56
  132 0.44 4
  133 6.7 67
  134 36.7 367
  135 56.7 567
  136 4.89 49
  137 8.9 89
  141 2.2 22
  145 47.8 478
  146 0.44 4
  149 8.9 89
  150 38.9 389
  151 3.3 33
  156 0.22 2
  160 18.9 189
  161 6.7 67
  162 1.1 11
  163 3.33 33
  164 5.6 56
  165 2.2 22
  166 1.1 11
  177 0.11 1
  178 99.99 999
  179 22.2 222
  180 4.4 44