ACCESSION: MSBNK-Fac_Eng_Univ_Tokyo-JP002134
RECORD_TITLE: ALPHA-METHYLBENZYL METHACRYLATE; EI-B; MS
DATE: 2016.01.19 (Created 2008.10.21, modified 2011.05.06)
AUTHORS: TAJIMA S, GUNMA COLLEGE OF TECHNOLOGY
LICENSE: CC BY-NC-SA

CH$NAME: ALPHA-METHYLBENZYL METHACRYLATE
CH$NAME: METHACRYLIC ACID ALPHA-METHYLBENZYL ESTER
CH$COMPOUND_CLASS: N/A
CH$FORMULA: C12H14O2
CH$EXACT_MASS: 190.09938
CH$SMILES: CC(=C)C(=O)OC(C)c(c1)cccc1
CH$IUPAC: InChI=1S/C12H14O2/c1-9(2)12(13)14-10(3)11-7-5-4-6-8-11/h4-8,10H,1H2,2-3H3
CH$LINK: INCHIKEY BQMWZHUIGYNOAL-UHFFFAOYSA-N
CH$LINK: COMPTOX DTXSID00440705

AC$INSTRUMENT: HITACHI RMU-7M
AC$INSTRUMENT_TYPE: EI-B
AC$MASS_SPECTROMETRY: MS_TYPE MS
AC$MASS_SPECTROMETRY: ION_MODE POSITIVE
AC$MASS_SPECTROMETRY: IONIZATION_ENERGY 70 eV

MS$FOCUSED_ION: ION_TYPE [M]+*

PK$SPLASH: splash10-0pvm-6900000000-ddd61fe8e43d35fe4b3d
PK$NUM_PEAK: 23
PK$PEAK: m/z int. rel.int.
  27 4.11 41
  28 4.39 44
  39 10.05 101
  41 36.18 362
  43 14.09 141
  50 1.52 15
  51 8.61 86
  52 1.52 15
  69 71.21 712
  70 12.11 121
  77 20.94 209
  78 13.1 131
  79 12.87 129
  103 14.39 144
  104 77.91 779
  105 99.99 999
  106 7.77 78
  121 15.23 152
  145 60.17 602
  146 6.7 67
  172 1.68 17
  175 1 10
  190 1.22 12