ACCESSION: MSBNK-Fac_Eng_Univ_Tokyo-JP002136
RECORD_TITLE: ETHYL ACRYLATE; EI-B; MS
DATE: 2016.01.19 (Created 2008.10.21, modified 2011.05.06)
AUTHORS: TAJIMA S, GUNMA COLLEGE OF TECHNOLOGY
LICENSE: CC BY-NC-SA

CH$NAME: ETHYL ACRYLATE
CH$NAME: PROPENOIC ACID ETHYL ESTER
CH$COMPOUND_CLASS: N/A
CH$FORMULA: C5H8O2
CH$EXACT_MASS: 100.05243
CH$SMILES: CCOC(=O)C=C
CH$IUPAC: InChI=1S/C5H8O2/c1-3-5(6)7-4-2/h3H,1,4H2,2H3
CH$LINK: INCHIKEY JIGUQPWFLRLWPJ-UHFFFAOYSA-N
CH$LINK: COMPTOX DTXSID4020583

AC$INSTRUMENT: HITACHI RMU-7M
AC$INSTRUMENT_TYPE: EI-B
AC$MASS_SPECTROMETRY: MS_TYPE MS
AC$MASS_SPECTROMETRY: ION_MODE POSITIVE
AC$MASS_SPECTROMETRY: IONIZATION_ENERGY 70 eV

MS$FOCUSED_ION: ION_TYPE [M]+*

PK$SPLASH: splash10-0a4i-9000000000-8762b44567cd7afeb692
PK$NUM_PEAK: 21
PK$PEAK: m/z int. rel.int.
  15 1.32 13
  26 4.61 46
  27 26.91 269
  28 7.63 76
  29 18.42 184
  31 3.16 32
  41 1.97 20
  43 5.79 58
  44 3.29 33
  45 11.84 118
  54 4.08 41
  55 99.99 999
  56 12.04 120
  57 3.82 38
  58 4.93 49
  72 1.25 13
  73 8.22 82
  82 3.22 32
  85 3.82 38
  99 5.66 57
  100 0.92 9