ACCESSION: MSBNK-Fac_Eng_Univ_Tokyo-JP002317
RECORD_TITLE: Y-METHYLBICYCLO(4.3.0)NON-6-EN-8-ONE; EI-B; MS
DATE: 2016.01.19 (Created 2008.10.21, modified 2011.05.06)
AUTHORS: MASS SPECTROSCOPY SOC. OF JAPAN (MSSJ)
LICENSE: CC BY-NC-SA

CH$NAME: Y-METHYLBICYCLO(4.3.0)NON-6-EN-8-ONE
CH$COMPOUND_CLASS: N/A
CH$FORMULA: C10H14O
CH$EXACT_MASS: 150.10447
CH$SMILES: O=C(C=1)CC(C)(C2)C(CCC2)1
CH$IUPAC: InChI=1S/C10H14O/c1-10-5-3-2-4-8(10)6-9(11)7-10/h6H,2-5,7H2,1H3
CH$LINK: INCHIKEY HJDKCIOQDUHLEF-UHFFFAOYSA-N
CH$LINK: COMPTOX DTXSID10342867

AC$INSTRUMENT: JEOL JMS-D-3000
AC$INSTRUMENT_TYPE: EI-B
AC$MASS_SPECTROMETRY: MS_TYPE MS
AC$MASS_SPECTROMETRY: ION_MODE POSITIVE
AC$MASS_SPECTROMETRY: IONIZATION_ENERGY 70 eV

MS$FOCUSED_ION: ION_TYPE [M]+*

PK$SPLASH: splash10-0kil-6900000000-d7a8c5c8d8e324b3846e
PK$NUM_PEAK: 30
PK$PEAK: m/z int. rel.int.
  43 5.59 56
  51 9.68 97
  52 6.04 60
  53 12.71 127
  55 10.86 109
  65 10.19 102
  66 6.08 61
  67 12.51 125
  77 23.27 233
  78 7.07 71
  79 54.27 543
  80 15.54 155
  81 11.57 116
  82 13.13 131
  91 22.72 227
  93 37.28 373
  94 10.57 106
  95 6.09 61
  105 5.29 53
  107 37.35 374
  108 19.03 190
  109 61.11 611
  110 5.06 51
  121 34.29 343
  122 21.01 210
  135 99.99 999
  136 10.25 103
  149 5.09 51
  150 87.26 873
  151 10.31 103