ACCESSION: MSBNK-Fac_Eng_Univ_Tokyo-JP002340
RECORD_TITLE: CHLOROFORM; EI-B; MS
DATE: 2016.01.19 (Created 2008.10.21, modified 2011.05.06)
AUTHORS: MASS SPECTROSCOPY SOC. OF JAPAN (MSSJ)
LICENSE: CC BY-NC-SA

CH$NAME: CHLOROFORM
CH$COMPOUND_CLASS: N/A
CH$FORMULA: CHCl3
CH$EXACT_MASS: 117.91438
CH$SMILES: ClC(Cl)Cl
CH$IUPAC: InChI=1S/CHCl3/c2-1(3)4/h1H
CH$LINK: INCHIKEY HEDRZPFGACZZDS-UHFFFAOYSA-N
CH$LINK: COMPTOX DTXSID1020306

AC$INSTRUMENT: JEOL JMS-D-3000
AC$INSTRUMENT_TYPE: EI-B
AC$MASS_SPECTROMETRY: MS_TYPE MS
AC$MASS_SPECTROMETRY: ION_MODE POSITIVE
AC$MASS_SPECTROMETRY: IONIZATION_ENERGY 70 eV

MS$FOCUSED_ION: ION_TYPE [M]+*

PK$SPLASH: splash10-001r-9000000000-4c60f1e48cbdf424460b
PK$NUM_PEAK: 14
PK$PEAK: m/z int. rel.int.
  47 25.98 260
  48 13.39 134
  49 9 90
  50 4.47 45
  82 3.78 38
  83 99.99 999
  84 3.5 35
  85 65.55 656
  86 1.1 11
  87 10.41 104
  117 1.21 12
  118 1.98 20
  119 1.23 12
  120 2 20