ACCESSION: MSBNK-Fac_Eng_Univ_Tokyo-JP002360
RECORD_TITLE: 1,2-BIS(TRIMETHYLSILYL)ETHANE; EI-B; MS
DATE: 2016.01.19 (Created 2008.10.21, modified 2011.05.06)
AUTHORS: MASS SPECTROSCOPY SOC. OF JAPAN (MSSJ)
LICENSE: CC BY-NC-SA

CH$NAME: 1,2-BIS(TRIMETHYLSILYL)ETHANE
CH$COMPOUND_CLASS: N/A
CH$FORMULA: C8H22Si2
CH$EXACT_MASS: 174.12600
CH$SMILES: C[Si](C)(C)CC[Si](C)(C)C
CH$IUPAC: InChI=1S/C8H22Si2/c1-9(2,3)7-8-10(4,5)6/h7-8H2,1-6H3
CH$LINK: INCHIKEY DMKCEJPDZDUPDV-UHFFFAOYSA-N
CH$LINK: COMPTOX DTXSID00211376

AC$INSTRUMENT: JEOL JMS-D-3000
AC$INSTRUMENT_TYPE: EI-B
AC$MASS_SPECTROMETRY: MS_TYPE MS
AC$MASS_SPECTROMETRY: ION_MODE POSITIVE
AC$MASS_SPECTROMETRY: IONIZATION_ENERGY 70 eV

MS$FOCUSED_ION: ION_TYPE [M]+*

PK$SPLASH: splash10-00di-9100000000-b43cf7402ae0eb8e4244
PK$NUM_PEAK: 21
PK$PEAK: m/z int. rel.int.
  43 2.75 28
  44 1.94 19
  45 9.78 98
  58 7.99 80
  59 6.33 63
  72 1.82 18
  73 99.99 999
  74 9.41 94
  75 3.4 34
  85 14.56 146
  86 24.31 243
  87 3.16 32
  99 2.63 26
  131 7.62 76
  132 1.37 14
  157 3.49 35
  159 12.05 121
  160 2.35 24
  172 1.74 17
  174 7.71 77
  175 1.62 16