ACCESSION: MSBNK-Fac_Eng_Univ_Tokyo-JP002392
RECORD_TITLE: ETHYL(TRIMETHYLSILYL)KETENE; EI-B; MS
DATE: 2016.01.19 (Created 2008.10.21, modified 2011.05.06)
AUTHORS: MASS SPECTROSCOPY SOC. OF JAPAN (MSSJ)
LICENSE: CC BY-NC-SA

CH$NAME: ETHYL(TRIMETHYLSILYL)KETENE
CH$COMPOUND_CLASS: N/A
CH$FORMULA: C7H14OSi
CH$EXACT_MASS: 142.08139
CH$SMILES: CCC(=C=O)[Si](C)(C)C
CH$IUPAC: InChI=1S/C7H14OSi/c1-5-7(6-8)9(2,3)4/h5H2,1-4H3
CH$LINK: INCHIKEY RQSLKPHKSDWYDG-UHFFFAOYSA-N

AC$INSTRUMENT: JEOL JMS-D-3000
AC$INSTRUMENT_TYPE: EI-B
AC$MASS_SPECTROMETRY: MS_TYPE MS
AC$MASS_SPECTROMETRY: ION_MODE POSITIVE
AC$MASS_SPECTROMETRY: IONIZATION_ENERGY 70 eV

MS$FOCUSED_ION: ION_TYPE [M]+*

PK$SPLASH: splash10-004i-4900000000-7a4ddf476e471d5ab3e3
PK$NUM_PEAK: 21
PK$PEAK: m/z int. rel.int.
  32 11.47 115
  43 2.74 27
  55 10.22 102
  56 1.85 19
  57 4.08 41
  58 2.18 22
  69 4.08 41
  70 2.76 28
  71 3.13 31
  72 6.85 69
  82 6.06 61
  83 4.6 46
  84 2.46 25
  93 2.43 24
  97 13.12 131
  98 3.46 35
  111 31.66 317
  112 2.32 23
  126 99.99 999
  127 11.5 115
  142 3.74 37