ACCESSION: MSBNK-Fac_Eng_Univ_Tokyo-JP002398
RECORD_TITLE: ETHYL(PENTAMETHYLDISILANYL)KETENE; EI-B; MS
DATE: 2016.01.19 (Created 2008.10.21, modified 2011.05.06)
AUTHORS: MASS SPECTROSCOPY SOC. OF JAPAN (MSSJ)
LICENSE: CC BY-NC-SA

CH$NAME: ETHYL(PENTAMETHYLDISILANYL)KETENE
CH$COMPOUND_CLASS: N/A
CH$FORMULA: C9H20OSi2
CH$EXACT_MASS: 200.10527
CH$SMILES: CCC(=C=O)[Si](C)(C)[Si](C)(C)C
CH$IUPAC: InChI=1S/C9H20OSi2/c1-7-9(8-10)12(5,6)11(2,3)4/h7H2,1-6H3
CH$LINK: INCHIKEY FOOSEGCIMSEKQV-UHFFFAOYSA-N

AC$INSTRUMENT: JEOL JMS-D-3000
AC$INSTRUMENT_TYPE: EI-B
AC$MASS_SPECTROMETRY: MS_TYPE MS
AC$MASS_SPECTROMETRY: ION_MODE POSITIVE
AC$MASS_SPECTROMETRY: IONIZATION_ENERGY 70 eV

MS$FOCUSED_ION: ION_TYPE [M]+*

PK$SPLASH: splash10-00dj-9800000000-86fa42717b9def5533c1
PK$NUM_PEAK: 54
PK$PEAK: m/z int. rel.int.
  43 10.97 110
  45 17.22 172
  53 1.14 11
  55 2.03 20
  57 1.21 12
  58 3.09 31
  59 32.84 328
  60 2.8 28
  61 1.28 13
  69 2.69 27
  71 1.31 13
  72 1.15 12
  73 99.99 999
  74 8.23 82
  75 8.75 88
  83 7.96 80
  84 2.43 24
  85 1.77 18
  97 8.85 89
  98 12.16 122
  99 59.24 592
  100 6.59 66
  101 3.05 31
  103 1.55 16
  111 11.93 119
  112 1.47 15
  113 1.46 15
  115 1.7 17
  117 9.4 94
  118 1.23 12
  119 3.39 34
  127 56.18 562
  128 5.85 59
  129 3.86 39
  131 11.17 112
  132 1.89 19
  133 18.71 187
  134 2.63 26
  135 1.49 15
  141 1.19 12
  143 3.85 39
  145 1.15 12
  147 4.31 43
  155 2.1 21
  157 27.11 271
  158 4.83 48
  159 2.37 24
  171 1.24 12
  172 45.75 458
  173 8.38 84
  174 3.8 38
  185 9.49 95
  186 1.86 19
  200 1.02 10