ACCESSION: MSBNK-Fac_Eng_Univ_Tokyo-JP002536
RECORD_TITLE: ETHYL ACRYLATE; EI-B; MS
DATE: 2016.01.19 (Created 2008.10.21, modified 2011.05.06)
AUTHORS: YAMAMOTO M, DEP. CHEMISTRY, FAC. SCIENCE, NARA WOMEN'S UNIV.
LICENSE: CC BY-NC-SA

CH$NAME: ETHYL ACRYLATE
CH$COMPOUND_CLASS: N/A
CH$FORMULA: C5H8O2
CH$EXACT_MASS: 100.05243
CH$SMILES: CCOC(=O)C=C
CH$IUPAC: InChI=1S/C5H8O2/c1-3-5(6)7-4-2/h3H,1,4H2,2H3
CH$LINK: INCHIKEY JIGUQPWFLRLWPJ-UHFFFAOYSA-N
CH$LINK: COMPTOX DTXSID4020583

AC$INSTRUMENT: HITACHI RMU-6M
AC$INSTRUMENT_TYPE: EI-B
AC$MASS_SPECTROMETRY: MS_TYPE MS
AC$MASS_SPECTROMETRY: ION_MODE POSITIVE
AC$MASS_SPECTROMETRY: IONIZATION_ENERGY 70 eV

MS$FOCUSED_ION: ION_TYPE [M]+*

PK$SPLASH: splash10-0a6r-9000000000-25b2b71f04040f0959dd
PK$NUM_PEAK: 22
PK$PEAK: m/z int. rel.int.
  15 2.35 24
  26 7.47 75
  27 38.1 381
  28 5.64 56
  29 19.23 192
  31 2.1 21
  41 1.6 16
  43 5.31 53
  44 1.58 16
  45 11.2 112
  53 1.23 12
  54 3.68 37
  55 99.99 999
  56 8.87 89
  57 1.3 13
  58 4.36 44
  72 1.08 11
  73 7.14 71
  82 3.38 34
  84 3.73 37
  99 5.64 56
  100 4.51 45