ACCESSION: MSBNK-Fac_Eng_Univ_Tokyo-JP002945
RECORD_TITLE: ETHYL NITRITE; EI-B; MS
DATE: 2016.01.19 (Created 2008.10.21, modified 2011.05.06)
AUTHORS: MASS SPECTROSCOPY SOC. OF JAPAN (MSSJ)
LICENSE: CC BY-NC-SA

CH$NAME: ETHYL NITRITE
CH$COMPOUND_CLASS: N/A
CH$FORMULA: C2H5NO2
CH$EXACT_MASS: 75.03203
CH$SMILES: CCON=O
CH$IUPAC: InChI=1S/C2H5NO2/c1-2-5-3-4/h2H2,1H3
CH$LINK: INCHIKEY QQZWEECEMNQSTG-UHFFFAOYSA-N
CH$LINK: COMPTOX DTXSID9046574

AC$INSTRUMENT: Unknown
AC$INSTRUMENT_TYPE: EI-B
AC$MASS_SPECTROMETRY: MS_TYPE MS
AC$MASS_SPECTROMETRY: ION_MODE POSITIVE

MS$FOCUSED_ION: ION_TYPE [M]+*

PK$SPLASH: splash10-003r-9000000000-88c8ffa4f735e44499c2
PK$NUM_PEAK: 11
PK$PEAK: m/z int. rel.int.
  14 6.4 64
  15 17.43 174
  26 3.3 33
  27 15.85 159
  28 3.53 35
  29 48.15 482
  30 99.99 999
  31 8.18 82
  43 10.52 105
  45 10.69 107
  60 32.34 323