ACCESSION: MSBNK-Fac_Eng_Univ_Tokyo-JP003086
RECORD_TITLE: STRYCHNINE; EI-B; MS
DATE: 2016.01.19 (Created 2008.10.21, modified 2011.05.06)
AUTHORS: SASAKI S, TOYOHASHI UNIV. OF TECH.
LICENSE: CC BY-NC-SA

CH$NAME: STRYCHNINE
CH$COMPOUND_CLASS: N/A
CH$FORMULA: C21H22N2O2
CH$EXACT_MASS: 334.16813
CH$SMILES: c(c7)cc(c(c7)1)N(C(=O)5)C([H])(C([H])42)C(C6)1C([H])(N3C6)CC([H])(C(=CCOC([H])(C5)4)C3)2
CH$IUPAC: InChI=1S/C21H22N2O2/c24-18-10-16-19-13-9-17-21(6-7-22(17)11-12(13)5-8-25-16)14-3-1-2-4-15(14)23(18)20(19)21/h1-5,13,16-17,19-20H,6-11H2/t13-,16-,17-,19-,20-,21+/m0/s1
CH$LINK: INCHIKEY QMGVPVSNSZLJIA-FVWCLLPLSA-N
CH$LINK: COMPTOX DTXSID6023600

AC$INSTRUMENT: Unknown
AC$INSTRUMENT_TYPE: EI-B
AC$MASS_SPECTROMETRY: MS_TYPE MS
AC$MASS_SPECTROMETRY: ION_MODE POSITIVE

MS$FOCUSED_ION: ION_TYPE [M]+*

PK$SPLASH: splash10-053u-7932000000-04182929c472fb9f2b05
PK$NUM_PEAK: 305
PK$PEAK: m/z int. rel.int.
  29 9.4 94
  30 9.7 97
  31 2.6 26
  32 1.05 11
  33 0.1 1
  34 0.2 2
  35 8.2 82
  36 2.83 28
  37 3.7 37
  38 13 130
  39 22.5 225
  40 0.61 6
  41 33.8 338
  42 24.1 241
  43 18.1 181
  44 4.42 44
  45 3.5 35
  46 1.9 19
  47 3.1 31
  48 0.19 2
  49 2.1 21
  50 6.1 61
  51 14.7 147
  52 0.72 7
  53 12.4 124
  54 11.5 115
  55 32.8 328
  56 1.85 19
  57 9.3 93
  58 6 60
  59 2.4 24
  60 0.21 2
  61 2.1 21
  62 2.9 29
  63 7.2 72
  64 0.37 4
  65 15.4 154
  66 6.5 65
  67 11.9 119
  68 0.11 1
  69 9.2 92
  70 6.7 67
  71 4.3 43
  72 0.22 2
  73 3.2 32
  74 3.1 31
  75 8.4 84
  76 0.06 1
  77 34.9 349
  78 13.9 139
  79 25.7 257
  80 1.61 16
  81 12.4 124
  82 14.7 147
  83 4.5 45
  84 0.41 4
  85 2.4 24
  86 2 20
  87 2.7 27
  88 0.04 0
  89 9.2 92
  90 5.8 58
  91 26.9 269
  92 0.87 9
  93 16.9 169
  94 21.5 215
  95 9.7 97
  96 0.49 5
  97 8.4 84
  98 4.5 45
  99 2.1 21
  100 0.24 2
  101 4.9 49
  102 9.4 94
  103 9.1 91
  104 0.65 7
  105 13.4 134
  106 15.5 155
  107 32.9 329
  108 1.91 19
  109 7.2 72
  110 3.1 31
  111 2.4 24
  112 0.22 2
  113 3.9 39
  114 4.5 45
  115 24.9 249
  116 1.02 10
  117 17.9 179
  118 12.8 128
  119 22.7 227
  120 3.65 37
  121 19 190
  122 9 90
  123 3.9 39
  124 0.29 3
  125 2.7 27
  126 5.2 52
  127 9.2 92
  128 1.27 13
  129 14.1 141
  130 31.4 314
  131 11.4 114
  132 1.54 15
  133 12.6 126
  134 21.9 219
  135 11 110
  136 1.52 15
  137 5.8 58
  138 7.4 74
  139 7 70
  140 0.07 1
  141 4.9 49
  142 8 80
  143 28.5 285
  144 0.32 3
  145 7.6 76
  146 8.7 87
  147 9.4 94
  148 0.59 6
  149 3.7 37
  150 3.2 32
  151 3.2 32
  152 0.81 8
  153 4.9 49
  154 12.7 127
  155 7.8 78
  156 0.98 10
  157 5.8 58
  158 5.9 59
  159 3.4 34
  160 0.38 4
  161 18.1 181
  162 22.5 225
  163 11 110
  164 0.45 5
  165 6.4 64
  166 8.2 82
  167 26.4 264
  168 1.87 19
  169 7.9 79
  170 6 60
  171 5.9 59
  172 0.81 8
  173 2.9 29
  174 2.7 27
  175 5.2 52
  176 0.41 4
  177 3.8 38
  178 5.2 52
  179 4.2 42
  180 1.41 14
  181 8.5 85
  182 8.9 89
  183 9.4 94
  184 0.74 7
  185 5.4 54
  186 6.4 64
  187 2.7 27
  188 0.17 2
  189 2.4 24
  190 3.4 34
  191 8.7 87
  192 0.74 7
  193 7.2 72
  194 8.1 81
  195 4.7 47
  196 0.07 1
  197 5 50
  198 3.7 37
  199 2.9 29
  200 0.19 2
  201 3 30
  202 2.6 26
  203 3.1 31
  204 0.1 1
  205 6 60
  206 8.1 81
  207 5.2 52
  208 0.57 6
  209 5.4 54
  210 7 70
  211 3.6 36
  212 0.37 4
  213 3 30
  214 2.2 22
  215 2.6 26
  216 0.81 8
  217 6.4 64
  218 9.2 92
  219 10.1 101
  220 1.81 18
  221 9 90
  222 6.1 61
  223 4.7 47
  224 0.26 3
  225 2.2 22
  226 1.7 17
  227 1.9 19
  228 0.26 3
  229 2.4 24
  230 3.9 39
  231 3.4 34
  232 0.67 7
  233 8.7 87
  234 7.2 72
  235 6.2 62
  236 0.46 5
  237 3.1 31
  238 2.2 22
  239 1.4 14
  240 0.26 3
  241 1.5 15
  242 1.4 14
  243 2.4 24
  244 0.29 3
  245 4.9 49
  246 6.2 62
  247 6.6 66
  248 0.54 5
  249 5.1 51
  250 2.9 29
  251 2.1 21
  252 0.12 1
  253 1.4 14
  254 1 10
  255 1.2 12
  256 0.14 1
  257 2.1 21
  258 3.9 39
  259 5.1 51
  260 0.54 5
  261 8.7 87
  262 5.9 59
  263 6.7 67
  264 0.48 5
  265 3.4 34
  266 1.1 11
  267 0.1 1
  268 0.04 0
  269 1.1 11
  270 2 20
  271 2.9 29
  272 0.3 3
  273 3.9 39
  274 4.4 44
  275 5.7 57
  276 0.44 4
  277 17 170
  278 5.9 59
  279 5.2 52
  280 0.19 2
  281 1.1 11
  282 0.2 2
  283 0.1 1
  284 0.09 1
  285 1.9 19
  286 2.1 21
  287 4.1 41
  288 0.39 4
  289 5.9 59
  290 3.7 37
  291 5 50
  292 0.29 3
  293 2.1 21
  294 0.4 4
  295 0.1 1
  296 0.01 0
  299 0.2 2
  300 1 10
  301 2.6 26
  302 0.21 2
  303 8 80
  304 6 60
  305 8 80
  306 1.12 11
  307 3.4 34
  308 1.4 14
  309 11 110
  310 0.01 0
  311 0.4 4
  312 1.1 11
  313 1.8 18
  314 0.17 2
  315 2.1 21
  316 2.7 27
  317 2.5 25
  318 0.26 3
  319 9.1 91
  320 3.6 36
  321 1.4 14
  322 0.04 0
  323 0.1 1
  327 0.1 1
  328 0.2 2
  329 0.11 1
  330 2.1 21
  331 4.1 41
  332 15.2 152
  333 1.63 16
  334 99.99 999
  335 27.2 272
  336 4.9 49
  337 0.11 1
  338 0.2 2